lsr:wb-ls
type: Ontology
format version [obo_vocabulary:format-version]: 1.2
date [obo_vocabulary:date]: 25:03:2014 07:17
saved by [obo_vocabulary:saved-by]: danielaraciti
auto generated by [obo_vocabulary:auto-generated-by]: OBO-Edit 2.2-rc1
default namespace [obo_vocabulary:default-namespace]: worm_development
ontology [obo_vocabulary:ontology]: wbls
remark [obo_vocabulary:remark]: Version: 1.04
remark [obo_vocabulary:remark]: Editors: Wen J. Chen & Daniela Raciti, WormBase, Caltech

format version [obo_vocabulary:format-version]
Bio2RDF namespace: obo_vocabulary
Bio2RDF identifier: format-version
type: obo_vocabulary resource [obo_vocabulary:Resource]
in dataset: bioportal resource:bio2rdf.dataset.bioportal.R3
title: format version
type: DatatypeProperty

Bio2RDF namespace
type: DatatypeProperty

Bio2RDF identifier
type: DatatypeProperty

Bio2RDF uri
type: DatatypeProperty

identifiers.org URI
type: ObjectProperty

Provider URI
type: ObjectProperty

date [obo_vocabulary:date]
Bio2RDF namespace: obo_vocabulary
Bio2RDF identifier: date
type: obo_vocabulary resource [obo_vocabulary:Resource]
in dataset: bioportal resource:bio2rdf.dataset.bioportal.R3
title: date
type: DatatypeProperty

saved by [obo_vocabulary:saved-by]
Bio2RDF namespace: obo_vocabulary
Bio2RDF identifier: saved-by
type: obo_vocabulary resource [obo_vocabulary:Resource]
in dataset: bioportal resource:bio2rdf.dataset.bioportal.R3
title: saved by
type: DatatypeProperty

auto generated by [obo_vocabulary:auto-generated-by]
Bio2RDF namespace: obo_vocabulary
Bio2RDF identifier: auto-generated-by
type: obo_vocabulary resource [obo_vocabulary:Resource]
in dataset: bioportal resource:bio2rdf.dataset.bioportal.R3
title: auto generated by
type: DatatypeProperty

default namespace [obo_vocabulary:default-namespace]
Bio2RDF namespace: obo_vocabulary
Bio2RDF identifier: default-namespace
type: obo_vocabulary resource [obo_vocabulary:Resource]
in dataset: bioportal resource:bio2rdf.dataset.bioportal.R3
title: default namespace
type: DatatypeProperty

ontology [obo_vocabulary:ontology]
Bio2RDF namespace: obo_vocabulary
Bio2RDF identifier: ontology
type: obo_vocabulary resource [obo_vocabulary:Resource]
in dataset: bioportal resource:bio2rdf.dataset.bioportal.R3
title: ontology
type: DatatypeProperty

remark [obo_vocabulary:remark]
Bio2RDF namespace: obo_vocabulary
Bio2RDF identifier: remark
type: obo_vocabulary resource [obo_vocabulary:Resource]
in dataset: bioportal resource:bio2rdf.dataset.bioportal.R3
title: remark
type: DatatypeProperty

all stages Ce [wbls:0000002]
Bio2RDF namespace: wbls
Bio2RDF identifier: 0000002
type: wbls resource [wbls_vocabulary:Resource]
in dataset: bioportal resource:bio2rdf.dataset.bioportal.R3
title: all stages Ce
type: Class
description: All C. elegans development stages, including embryo, larva and adult stage. [wb:wjc]
subclass of: Nematoda Life Stage [wbls:0000075]

Nematoda Life Stage [wbls:0000075]
Bio2RDF namespace: wbls
Bio2RDF identifier: 0000075
type: wbls resource [wbls_vocabulary:Resource]
in dataset: bioportal resource:bio2rdf.dataset.bioportal.R3
title: Nematoda Life Stage
type: Class
created_by [obo_vocabulary:created_by]: danielaraciti
creation_date [obo_vocabulary:creation_date]: 2012-05-30T09:04:28Z
subclass of: obo vocabulary:Entity

embryo Ce [wbls:0000003]
Bio2RDF namespace: wbls
Bio2RDF identifier: 0000003
type: wbls resource [wbls_vocabulary:Resource]
in dataset: bioportal resource:bio2rdf.dataset.bioportal.R3
title: embryo Ce
type: Class
description: The whole period of embryogenesis, from the formation of an egg till its hatch. [wb:wjc]
subclass of: all stages Ce [wbls:0000002]

proliferating embryo Ce [wbls:0000004]
Bio2RDF namespace: wbls
Bio2RDF identifier: 0000004
type: wbls resource [wbls_vocabulary:Resource]
in dataset: bioportal resource:bio2rdf.dataset.bioportal.R3
title: proliferating embryo Ce
type: Class
description: 0-350min after first cleavage at 20 Centigrade. Proliferate from 1 cell to 560 cells. From start of first cleavage till cleavage is over. [wb:wjc]
part_of [obo_vocabulary:part_of]: embryo Ce [wbls:0000003]
subclass of: obo vocabulary:Entity

part_of [obo_vocabulary:part_of]
Bio2RDF namespace: obo_vocabulary
Bio2RDF identifier: part_of
type: obo_vocabulary resource [obo_vocabulary:Resource]
in dataset: bioportal resource:bio2rdf.dataset.bioportal.R3
title: part_of
type: ObjectProperty

obo vocabulary:Entity
Bio2RDF namespace: obo_vocabulary
Bio2RDF identifier: Entity
type: obo_vocabulary resource [obo_vocabulary:Resource]
in dataset: bioportal resource:bio2rdf.dataset.bioportal.R3

blastula embryo Ce [wbls:0000005]
Bio2RDF namespace: wbls
Bio2RDF identifier: 0000005
type: wbls resource [wbls_vocabulary:Resource]
in dataset: bioportal resource:bio2rdf.dataset.bioportal.R3
title: blastula embryo Ce
type: Class
description: 0-100min after first cleavage at 20 Centigrade. Proliferate from 1 cell to 28 cells. From first cleavage till the start of gastrulation. [wb:wjc]
part_of [obo_vocabulary:part_of]: proliferating embryo Ce [wbls:0000004]
subclass of: obo vocabulary:Entity

1-cell embryo Ce [wbls:0000006]
Bio2RDF namespace: wbls
Bio2RDF identifier: 0000006
type: wbls resource [wbls_vocabulary:Resource]
in dataset: bioportal resource:bio2rdf.dataset.bioportal.R3
title: 1-cell embryo Ce
type: Class
description: Also called zygote. -50min till 0min of first cleavage at 20 Centigrade. Contains 1 cell. [wb:wjc]
part_of [obo_vocabulary:part_of]: blastula embryo Ce [wbls:0000005]
subclass of: obo vocabulary:Entity

2-cell embryo Ce [wbls:0000007]
Bio2RDF namespace: wbls
Bio2RDF identifier: 0000007
type: wbls resource [wbls_vocabulary:Resource]
in dataset: bioportal resource:bio2rdf.dataset.bioportal.R3
title: 2-cell embryo Ce
type: Class
description: 0-20min after first cleavage at 20 Centigrade. Contains 2 cells. [wb:wjc]
part_of [obo_vocabulary:part_of]: blastula embryo Ce [wbls:0000005]
starts_at_end_of [obo_vocabulary:starts_at_end_of]: 1-cell embryo Ce [wbls:0000006]
subclass of: obo vocabulary:Entity

starts_at_end_of [obo_vocabulary:starts_at_end_of]
Bio2RDF namespace: obo_vocabulary
Bio2RDF identifier: starts_at_end_of
type: obo_vocabulary resource [obo_vocabulary:Resource]
in dataset: bioportal resource:bio2rdf.dataset.bioportal.R3
title: starts_at_end_of
type: ObjectProperty

4-cell embryo Ce [wbls:0000008]
Bio2RDF namespace: wbls
Bio2RDF identifier: 0000008
type: wbls resource [wbls_vocabulary:Resource]
in dataset: bioportal resource:bio2rdf.dataset.bioportal.R3
title: 4-cell embryo Ce
type: Class
description: 20-40min after first cleavage at 20 Centigrade. Contains 4 cells. [wb:wjc]
part_of [obo_vocabulary:part_of]: blastula embryo Ce [wbls:0000005]
starts_at_end_of [obo_vocabulary:starts_at_end_of]: 2-cell embryo Ce [wbls:0000007]
subclass of: obo vocabulary:Entity

28-cell embryo Ce [wbls:0000009]
Bio2RDF namespace: wbls
Bio2RDF identifier: 0000009
type: wbls resource [wbls_vocabulary:Resource]
in dataset: bioportal resource:bio2rdf.dataset.bioportal.R3
title: 28-cell embryo Ce
type: Class
description: 100-105 min after first cleaveage at 20 Centigrade. Contains 28 cells. [wb:wjc]
part_of [obo_vocabulary:part_of]: gastrulating embryo Ce [wbls:0000010]
subclass of: obo vocabulary:Entity

gastrulating embryo Ce [wbls:0000010]
Bio2RDF namespace: wbls
Bio2RDF identifier: 0000010
type: wbls resource [wbls_vocabulary:Resource]
in dataset: bioportal resource:bio2rdf.dataset.bioportal.R3
title: gastrulating embryo Ce
type: Class
description: 100-290min after first cleavage at 20 Centigrade. Proliferate from 28 cells to 421 cells. Referring to the whole period of gastrulation. [wb:wjc]
part_of [obo_vocabulary:part_of]: proliferating embryo Ce [wbls:0000004]
starts_at_end_of [obo_vocabulary:starts_at_end_of]: blastula embryo Ce [wbls:0000005]
subclass of: obo vocabulary:Entity

51-cell embryo Ce [wbls:0000011]
Bio2RDF namespace: wbls
Bio2RDF identifier: 0000011
type: wbls resource [wbls_vocabulary:Resource]
in dataset: bioportal resource:bio2rdf.dataset.bioportal.R3
title: 51-cell embryo Ce
type: Class
description: 120-135 min after first cleavage at 20 Centigrade. Contains 51 cells. [wb:wjc]
part_of [obo_vocabulary:part_of]: gastrulating embryo Ce [wbls:0000010]
preceded_by [obo_vocabulary:preceded_by]: 44-cell embryo Ce [wbls:0000086]
subclass of: obo vocabulary:Entity

preceded_by [obo_vocabulary:preceded_by]
Bio2RDF namespace: obo_vocabulary
Bio2RDF identifier: preceded_by
type: obo_vocabulary resource [obo_vocabulary:Resource]
in dataset: bioportal resource:bio2rdf.dataset.bioportal.R3
title: preceded_by
type: ObjectProperty

44-cell embryo Ce [wbls:0000086]
Bio2RDF namespace: wbls
Bio2RDF identifier: 0000086
type: wbls resource [wbls_vocabulary:Resource]
in dataset: bioportal resource:bio2rdf.dataset.bioportal.R3
title: 44-cell embryo Ce
type: Class
description: Fifth cleavage of the AB lineage. Contains 44 cells. [wb:dr]
comment [obo_vocabulary:comment]: Levin M, Hashimshony T, Wagner F, Yanai I. Developmental milestones punctuate gene expression in the Caenorhabditis embryo. Dev Cell. 2012 May 15;22(5):1101-8. Epub 2012 May 3. PubMed PMID: 22560298. Supplementary table 1.
part_of [obo_vocabulary:part_of]: gastrulating embryo Ce [wbls:0000010]
preceded_by [obo_vocabulary:preceded_by]: 28-cell embryo Ce [wbls:0000009]
created_by [obo_vocabulary:created_by]: danielaraciti
creation_date [obo_vocabulary:creation_date]: 2012-10-02T17:25:18Z
subclass of: obo vocabulary:Entity

88-cell embryo Ce [wbls:0000012]
Bio2RDF namespace: wbls
Bio2RDF identifier: 0000012
type: wbls resource [wbls_vocabulary:Resource]
in dataset: bioportal resource:bio2rdf.dataset.bioportal.R3
title: 88-cell embryo Ce
type: Class
description: 145-150 min after first cleavage at 20 Centigrade. Contains 88 cells. [wb:wjc]
part_of [obo_vocabulary:part_of]: gastrulating embryo Ce [wbls:0000010]
preceded_by [obo_vocabulary:preceded_by]: 86-cell embryo Ce [wbls:0000088]
subclass of: obo vocabulary:Entity

86-cell embryo Ce [wbls:0000088]
Bio2RDF namespace: wbls
Bio2RDF identifier: 0000088
type: wbls resource [wbls_vocabulary:Resource]
in dataset: bioportal resource:bio2rdf.dataset.bioportal.R3
title: 86-cell embryo Ce
type: Class
description: Seventh cleavage of the AB lineage. Contains 86 cells. [wb:dr]
comment [obo_vocabulary:comment]: Levin M, Hashimshony T, Wagner F, Yanai I. Developmental milestones punctuate gene expression in the Caenorhabditis embryo. Dev Cell. 2012 May 15;22(5):1101-8. Epub 2012 May 3. PubMed PMID: 22560298. Supplementary table 1.
part_of [obo_vocabulary:part_of]: gastrulating embryo Ce [wbls:0000010]
preceded_by [obo_vocabulary:preceded_by]: 68-cell embryo Ce [wbls:0000087]
created_by [obo_vocabulary:created_by]: danielaraciti
creation_date [obo_vocabulary:creation_date]: 2012-10-02T17:27:50Z
subclass of: obo vocabulary:Entity

enclosing embryo Ce [wbls:0000013]
Bio2RDF namespace: wbls
Bio2RDF identifier: 0000013
type: wbls resource [wbls_vocabulary:Resource]
in dataset: bioportal resource:bio2rdf.dataset.bioportal.R3
title: enclosing embryo Ce
type: Class
description: 290-350min after first cleavage at 20 Centigrade. Proliferate from 421 cells to 560 cells. The stage when embryo just finished gastulation and is enclosing. [wb:wjc]
part_of [obo_vocabulary:part_of]: late cleavage stage embryo Ce [wbls:0000014]
starts_at_end_of [obo_vocabulary:starts_at_end_of]: gastrulating embryo Ce [wbls:0000010]
preceded_by [obo_vocabulary:preceded_by]: late cleavage stage embryo Ce [wbls:0000014]
subclass of: obo vocabulary:Entity

late cleavage stage embryo Ce [wbls:0000014]
Bio2RDF namespace: wbls
Bio2RDF identifier: 0000014
type: wbls resource [wbls_vocabulary:Resource]
in dataset: bioportal resource:bio2rdf.dataset.bioportal.R3
title: late cleavage stage embryo Ce
type: Class
description: 210-350min after first cleavage at 20 Centigrade. Proliferate from 421 cells to 560 cells. The stage before the fast cleavage of cells finishes. [wb:wjc]
part_of [obo_vocabulary:part_of]: proliferating embryo Ce [wbls:0000004]
preceded_by [obo_vocabulary:preceded_by]: gastrulating embryo Ce [wbls:0000010]
subclass of: obo vocabulary:Entity

elongating embryo Ce [wbls:0000015]
Bio2RDF namespace: wbls
Bio2RDF identifier: 0000015
type: wbls resource [wbls_vocabulary:Resource]
in dataset: bioportal resource:bio2rdf.dataset.bioportal.R3
title: elongating embryo Ce
type: Class
description: 350-620min after first cleavage at 20 Centigrade. Cell number remains at ~560 cells, with some new cells generated and some cells go through programmed cell death. The stage that embryo starts elongation till elongation is over. [wb:wjc]
part_of [obo_vocabulary:part_of]: embryo Ce [wbls:0000003]
starts_at_end_of [obo_vocabulary:starts_at_end_of]: proliferating embryo Ce [wbls:0000004]
preceded_by [obo_vocabulary:preceded_by]: gastrulating embryo Ce [wbls:0000010]
subclass of: obo vocabulary:Entity

bean embryo Ce [wbls:0000016]
Bio2RDF namespace: wbls
Bio2RDF identifier: 0000016
type: wbls resource [wbls_vocabulary:Resource]
in dataset: bioportal resource:bio2rdf.dataset.bioportal.R3
title: bean embryo Ce
type: Class
description: 350-390min after first cleavage at 20 Centigrade. Cell number remains at ~560 cells, with some new cells generated and some cells go through programmed cell death. Emrbyo elongation started but have not formed comma shape yet. The shape of embryo looks like a lima bean. A stage right before comma embryo. Also called lima embryo or lima bean stage. [wb:wjc]
part_of [obo_vocabulary:part_of]: elongating embryo Ce [wbls:0000015]
starts_at_end_of [obo_vocabulary:starts_at_end_of]: enclosing embryo Ce [wbls:0000013]
starts_at_end_of [obo_vocabulary:starts_at_end_of]: late cleavage stage embryo Ce [wbls:0000014]
subclass of: obo vocabulary:Entity

comma embryo Ce [wbls:0000017]
Bio2RDF namespace: wbls
Bio2RDF identifier: 0000017
type: wbls resource [wbls_vocabulary:Resource]
in dataset: bioportal resource:bio2rdf.dataset.bioportal.R3
title: comma embryo Ce
type: Class
description: 390-420min after first cleavage at 20 Centigrade. Cell number remains at ~560 cells, with some new cells generated and some cells go through programmed cell death. The shape of embryo looks like a comma. A stage between bean embryo and 1.5-fold embryo. [wb:wjc]
part_of [obo_vocabulary:part_of]: elongating embryo Ce [wbls:0000015]
starts_at_end_of [obo_vocabulary:starts_at_end_of]: bean embryo Ce [wbls:0000016]
subclass of: obo vocabulary:Entity

1.5-fold embryo Ce [wbls:0000018]
Bio2RDF namespace: wbls
Bio2RDF identifier: 0000018
type: wbls resource [wbls_vocabulary:Resource]
in dataset: bioportal resource:bio2rdf.dataset.bioportal.R3
title: 1.5-fold embryo Ce
type: Class
description: 420-460min after first cleavage at 20 Centigrade. Cell number remains at ~560 cells, with some new cells generated and some cells go through programmed cell death. The shape of embryo is elongated and fold back 50%. A stage between comma embryo and 2-fold embryo. [wb:wjc]
part_of [obo_vocabulary:part_of]: elongating embryo Ce [wbls:0000015]
starts_at_end_of [obo_vocabulary:starts_at_end_of]: comma embryo Ce [wbls:0000017]
subclass of: obo vocabulary:Entity

2-fold embryo Ce [wbls:0000019]
Bio2RDF namespace: wbls
Bio2RDF identifier: 0000019
type: wbls resource [wbls_vocabulary:Resource]
in dataset: bioportal resource:bio2rdf.dataset.bioportal.R3
title: 2-fold embryo Ce
type: Class
description: 460-520min after first cleavage at 20 Centigrade. Cell number remains at ~560 cells, with some new cells generated and some cells go through programmed cell death. The shape of embryo is elongated and double fold. A stage between 1.5-fold embryo and 3-fold embryo. [wb:wjc]
part_of [obo_vocabulary:part_of]: elongating embryo Ce [wbls:0000015]
starts_at_end_of [obo_vocabulary:starts_at_end_of]: 1.5-fold embryo Ce [wbls:0000018]
subclass of: obo vocabulary:Entity

3-fold embryo Ce [wbls:0000020]
Bio2RDF namespace: wbls
Bio2RDF identifier: 0000020
type: wbls resource [wbls_vocabulary:Resource]
in dataset: bioportal resource:bio2rdf.dataset.bioportal.R3
title: 3-fold embryo Ce
type: Class
description: 520-620min after first cleavage at 20 Centigrade. Cell number remains at ~560 cells, with some new cells generated and some cells go through programmed cell death. The shape of embryo is elongated and tripple fold. A stage between 2-fold embryo and fully-elongated embryo. Also called pretzel embryo or pretzel stage. [wb:wjc]
part_of [obo_vocabulary:part_of]: elongating embryo Ce [wbls:0000015]
starts_at_end_of [obo_vocabulary:starts_at_end_of]: 2-fold embryo Ce [wbls:0000019]
subclass of: obo vocabulary:Entity

fully-elongated embryo Ce [wbls:0000021]
Bio2RDF namespace: wbls
Bio2RDF identifier: 0000021
type: wbls resource [wbls_vocabulary:Resource]
in dataset: bioportal resource:bio2rdf.dataset.bioportal.R3
title: fully-elongated embryo Ce
type: Class
description: 620-800min(hatch) after first cleavage at 20 Centigrade. Cell number remains at ~560 cells, with some new cells generated and some cells go through programmed cell death. A stage after elongation is over. The last stage of embryogenesis. Also called pre-hatched embryo, late embryo or morphogenetic embryo. [wb:wjc]
part_of [obo_vocabulary:part_of]: embryo Ce [wbls:0000003]
starts_at_end_of [obo_vocabulary:starts_at_end_of]: elongating embryo Ce [wbls:0000015]
starts_at_end_of [obo_vocabulary:starts_at_end_of]: 3-fold embryo Ce [wbls:0000020]
subclass of: obo vocabulary:Entity

postembryonic Ce [wbls:0000022]
Bio2RDF namespace: wbls
Bio2RDF identifier: 0000022
type: wbls resource [wbls_vocabulary:Resource]
in dataset: bioportal resource:bio2rdf.dataset.bioportal.R3
title: postembryonic Ce
type: Class
description: The stage after hatch till death. [wb:wjc]
subclass of: all stages Ce [wbls:0000002]
starts_at_end_of [obo_vocabulary:starts_at_end_of]: embryo Ce [wbls:0000003]

larva Ce [wbls:0000023]
Bio2RDF namespace: wbls
Bio2RDF identifier: 0000023
type: wbls resource [wbls_vocabulary:Resource]
in dataset: bioportal resource:bio2rdf.dataset.bioportal.R3
title: larva Ce
type: Class
description: From the time after hatch till becomes adult. [wb:wjc]
part_of [obo_vocabulary:part_of]: postembryonic Ce [wbls:0000022]
starts_at_end_of [obo_vocabulary:starts_at_end_of]: embryo Ce [wbls:0000003]
subclass of: obo vocabulary:Entity

L1 larva Ce [wbls:0000024]
Bio2RDF namespace: wbls
Bio2RDF identifier: 0000024
type: wbls resource [wbls_vocabulary:Resource]
in dataset: bioportal resource:bio2rdf.dataset.bioportal.R3
title: L1 larva Ce
type: Class
description: The first stage larva. At 25 Centigrade, it ranges 14-25.5 hours after fertilization, 0-11.5 hours after hatch. [wb:wjc]
part_of [obo_vocabulary:part_of]: larva Ce [wbls:0000023]
starts_at_end_of [obo_vocabulary:starts_at_end_of]: embryo Ce [wbls:0000003]
subclass of: obo vocabulary:Entity

L1-L2 lethargus Ce [wbls:0000025]
Bio2RDF namespace: wbls
Bio2RDF identifier: 0000025
type: wbls resource [wbls_vocabulary:Resource]
in dataset: bioportal resource:bio2rdf.dataset.bioportal.R3
title: L1-L2 lethargus Ce
type: Class
description: The stage during L1-L2 molt when an animal becomes lethargic, ceases pharyngeal pumping and synthesizes new cuticle under the old. [wb:wjc]
part_of [obo_vocabulary:part_of]: L1-L2 molt Ce [wbls:0000026]
subclass of: obo vocabulary:Entity

L1-L2 molt Ce [wbls:0000026]
Bio2RDF namespace: wbls
Bio2RDF identifier: 0000026
type: wbls resource [wbls_vocabulary:Resource]
in dataset: bioportal resource:bio2rdf.dataset.bioportal.R3
title: L1-L2 molt Ce
type: Class
description: The stage when an animal shifts from L1 larva to L2 larva. It includes the synthesis of new cuticle, cease of phrayngeal pumping during a lethargus stage, and the shed off of old cuticle. [wb:wjc]
part_of [obo_vocabulary:part_of]: larva Ce [wbls:0000023]
starts_at_end_of [obo_vocabulary:starts_at_end_of]: L1 larva Ce [wbls:0000024]
subclass of: obo vocabulary:Entity

L2 larva Ce [wbls:0000027]
Bio2RDF namespace: wbls
Bio2RDF identifier: 0000027
type: wbls resource [wbls_vocabulary:Resource]
in dataset: bioportal resource:bio2rdf.dataset.bioportal.R3
title: L2 larva Ce
type: Class
description: The second stage larva. At 25 Centigrade, it ranges 25.5-32.5 hours after fertilization, 11.5-18.5 hours after hatch. [wb:wjc]
part_of [obo_vocabulary:part_of]: larva Ce [wbls:0000023]
preceded_by [obo_vocabulary:preceded_by]: L1 larva Ce [wbls:0000024]
starts_at_end_of [obo_vocabulary:starts_at_end_of]: L1-L2 molt Ce [wbls:0000026]
subclass of: obo vocabulary:Entity

L2-L3 lethargus Ce [wbls:0000028]
Bio2RDF namespace: wbls
Bio2RDF identifier: 0000028
type: wbls resource [wbls_vocabulary:Resource]
in dataset: bioportal resource:bio2rdf.dataset.bioportal.R3
title: L2-L3 lethargus Ce
type: Class
description: The stage during L2-L3 molt when an animal becomes lethargic, ceases pharyngeal pumping and synthesizes new cuticle under the old. [wb:wjc]
part_of [obo_vocabulary:part_of]: L2-L3 molt Ce [wbls:0000029]
subclass of: obo vocabulary:Entity

L2-L3 molt Ce [wbls:0000029]
Bio2RDF namespace: wbls
Bio2RDF identifier: 0000029
type: wbls resource [wbls_vocabulary:Resource]
in dataset: bioportal resource:bio2rdf.dataset.bioportal.R3
title: L2-L3 molt Ce
type: Class
description: The stage when an animal shifts from L2 larva to L3 larva. It includes the synthesis of new cuticle, cease of phrayngeal pumping during a lethargus stage, and the shed off of old cuticle. [wb:wjc]
part_of [obo_vocabulary:part_of]: larva Ce [wbls:0000023]
starts_at_end_of [obo_vocabulary:starts_at_end_of]: L2 larva Ce [wbls:0000027]
subclass of: obo vocabulary:Entity

L2d-dauer lethargus Ce [wbls:0000030]
Bio2RDF namespace: wbls
Bio2RDF identifier: 0000030
type: wbls resource [wbls_vocabulary:Resource]
in dataset: bioportal resource:bio2rdf.dataset.bioportal.R3
title: L2d-dauer lethargus Ce
type: Class
description: The stage during L2d-dauer molt when an animal becomes lethargic, ceases pharyngeal pumping and synthesizes new cuticle under the old. [wb:wjc]
part_of [obo_vocabulary:part_of]: L2d-dauer molt Ce [wbls:0000031]
subclass of: obo vocabulary:Entity

L2d-dauer molt Ce [wbls:0000031]
Bio2RDF namespace: wbls
Bio2RDF identifier: 0000031
type: wbls resource [wbls_vocabulary:Resource]
in dataset: bioportal resource:bio2rdf.dataset.bioportal.R3
title: L2d-dauer molt Ce
type: Class
description: The stage when an animal shifts from L2d larva to dauer larva. It includes the synthesis of new cuticle, cease of pharyngeal pumping during a lethargus stage, and the shed off of old cuticle. [wb:wjc]
part_of [obo_vocabulary:part_of]: larva Ce [wbls:0000023]
subclass of: obo vocabulary:Entity

dauer larva Ce [wbls:0000032]
Bio2RDF namespace: wbls
Bio2RDF identifier: 0000032
type: wbls resource [wbls_vocabulary:Resource]
in dataset: bioportal resource:bio2rdf.dataset.bioportal.R3
title: dauer larva Ce
type: Class
description: A third stage larva specialized for dispersal and long term survival. [ISBN:0-87969-433-5]
part_of [obo_vocabulary:part_of]: larva Ce [wbls:0000023]
preceded_by [obo_vocabulary:preceded_by]: L2 larva Ce [wbls:0000027]
subclass of: obo vocabulary:Entity

postdauer-L4 lethargus Ce [wbls:0000033]
Bio2RDF namespace: wbls
Bio2RDF identifier: 0000033
type: wbls resource [wbls_vocabulary:Resource]
in dataset: bioportal resource:bio2rdf.dataset.bioportal.R3
title: postdauer-L4 lethargus Ce
type: Class
description: The stage during postdauer-L4 molt when an animal becomes lethargic, ceases pharyngeal pumping and synthesizes new cuticle under the old. [wb:wjc]
part_of [obo_vocabulary:part_of]: postdauer-L4 molt Ce [wbls:0000034]
subclass of: obo vocabulary:Entity

postdauer-L4 molt Ce [wbls:0000034]
Bio2RDF namespace: wbls
Bio2RDF identifier: 0000034
type: wbls resource [wbls_vocabulary:Resource]
in dataset: bioportal resource:bio2rdf.dataset.bioportal.R3
title: postdauer-L4 molt Ce
type: Class
description: The stage when an animal shifts from post dauer stage to L4 larva. It includes the synthesis of new cuticle, cease of phrayngeal pumping during a lethargus stage, and the shed off of old cuticle. [wb:wjc]
part_of [obo_vocabulary:part_of]: post dauer stage Ce [wbls:0000052]
subclass of: obo vocabulary:Entity

post dauer stage Ce [wbls:0000052]
Bio2RDF namespace: wbls
Bio2RDF identifier: 0000052
type: wbls resource [wbls_vocabulary:Resource]
in dataset: bioportal resource:bio2rdf.dataset.bioportal.R3
title: post dauer stage Ce
type: Class
description: The stage right after an animal recovered from dauer but has not started transformation to L4 larva yet. [wb:wjc]
part_of [obo_vocabulary:part_of]: larva Ce [wbls:0000023]
subclass of: obo vocabulary:Entity

L3 larva Ce [wbls:0000035]
Bio2RDF namespace: wbls
Bio2RDF identifier: 0000035
type: wbls resource [wbls_vocabulary:Resource]
in dataset: bioportal resource:bio2rdf.dataset.bioportal.R3
title: L3 larva Ce
type: Class
description: The third stage larva. At 25 Centigrade, it ranges 32.5-40 hours after fertilization, 18.5-26 hours after hatch. [wb:wjc]
part_of [obo_vocabulary:part_of]: larva Ce [wbls:0000023]
preceded_by [obo_vocabulary:preceded_by]: L2 larva Ce [wbls:0000027]
starts_at_end_of [obo_vocabulary:starts_at_end_of]: L2-L3 molt Ce [wbls:0000029]
subclass of: obo vocabulary:Entity

L3-L4 lethargus Ce [wbls:0000036]
Bio2RDF namespace: wbls
Bio2RDF identifier: 0000036
type: wbls resource [wbls_vocabulary:Resource]
in dataset: bioportal resource:bio2rdf.dataset.bioportal.R3
title: L3-L4 lethargus Ce
type: Class
description: The stage during L3-L4 molt when an animal becomes lethargic, ceases pharyngeal pumping and synthesizes new cuticle under the old. [wb:wjc]
part_of [obo_vocabulary:part_of]: L3-L4 molt Ce [wbls:0000037]
subclass of: obo vocabulary:Entity

L3-L4 molt Ce [wbls:0000037]
Bio2RDF namespace: wbls
Bio2RDF identifier: 0000037
type: wbls resource [wbls_vocabulary:Resource]
in dataset: bioportal resource:bio2rdf.dataset.bioportal.R3
title: L3-L4 molt Ce
type: Class
description: The stage when an animal shifts from L3 larva to L4 larva. It includes the synthesis of new cuticle, cease of phrayngeal pumping during a lethargus stage, and the shed off of old cuticle. [wb:wjc]
part_of [obo_vocabulary:part_of]: larva Ce [wbls:0000023]
starts_at_end_of [obo_vocabulary:starts_at_end_of]: L3 larva Ce [wbls:0000035]
subclass of: obo vocabulary:Entity

L4 larva Ce [wbls:0000038]
Bio2RDF namespace: wbls
Bio2RDF identifier: 0000038
type: wbls resource [wbls_vocabulary:Resource]
in dataset: bioportal resource:bio2rdf.dataset.bioportal.R3
title: L4 larva Ce
type: Class
description: The fourth stage larva. At 25 Centigrade, it ranges 40-49.5 hours after fertilization, 26-35.5 hours after hatch. [wb:wjc]
part_of [obo_vocabulary:part_of]: larva Ce [wbls:0000023]
starts_at_end_of [obo_vocabulary:starts_at_end_of]: dauer larva Ce [wbls:0000032]
preceded_by [obo_vocabulary:preceded_by]: L3 larva Ce [wbls:0000035]
starts_at_end_of [obo_vocabulary:starts_at_end_of]: L3-L4 molt Ce [wbls:0000037]
subclass of: obo vocabulary:Entity

L4-adult lethargus Ce [wbls:0000039]
Bio2RDF namespace: wbls
Bio2RDF identifier: 0000039
type: wbls resource [wbls_vocabulary:Resource]
in dataset: bioportal resource:bio2rdf.dataset.bioportal.R3
title: L4-adult lethargus Ce
type: Class
description: The stage during L4-adult molt when an animal becomes lethargic, ceases pharyngeal pumping and synthesizes new cuticle under the old. [wb:wjc]
part_of [obo_vocabulary:part_of]: L4-adult molt Ce [wbls:0000040]
subclass of: obo vocabulary:Entity

L4-adult molt Ce [wbls:0000040]
Bio2RDF namespace: wbls
Bio2RDF identifier: 0000040
type: wbls resource [wbls_vocabulary:Resource]
in dataset: bioportal resource:bio2rdf.dataset.bioportal.R3
title: L4-adult molt Ce
type: Class
description: The stage when an animal shifts from L4 larva to adult. It includes the synthesis of new cuticle, cease of phrayngeal pumping during a lethargus stage, and the shed off of old cuticle. [wb:wjc]
part_of [obo_vocabulary:part_of]: larva Ce [wbls:0000023]
starts_at_end_of [obo_vocabulary:starts_at_end_of]: L4 larva Ce [wbls:0000038]
subclass of: obo vocabulary:Entity

adult Ce [wbls:0000041]
Bio2RDF namespace: wbls
Bio2RDF identifier: 0000041
type: wbls resource [wbls_vocabulary:Resource]
in dataset: bioportal resource:bio2rdf.dataset.bioportal.R3
title: adult Ce
type: Class
description: The stage after an animal is fully-developed and reaches maturity. [wb:wjc]
part_of [obo_vocabulary:part_of]: postembryonic Ce [wbls:0000022]
starts_at_end_of [obo_vocabulary:starts_at_end_of]: larva Ce [wbls:0000023]
preceded_by [obo_vocabulary:preceded_by]: L4 larva Ce [wbls:0000038]
starts_at_end_of [obo_vocabulary:starts_at_end_of]: L4-adult molt Ce [wbls:0000040]
subclass of: obo vocabulary:Entity

L1-L2 ecdysis Ce [wbls:0000042]
Bio2RDF namespace: wbls
Bio2RDF identifier: 0000042
type: wbls resource [wbls_vocabulary:Resource]
in dataset: bioportal resource:bio2rdf.dataset.bioportal.R3
title: L1-L2 ecdysis Ce
type: Class
description: The stage during L1-L2 molt, after the brief lethargus period, when an animal sheds off old cuticle. [wb:wjc]
part_of [obo_vocabulary:part_of]: L1-L2 molt Ce [wbls:0000026]
starts_at_end_of [obo_vocabulary:starts_at_end_of]: L1-L2 lethargus Ce [wbls:0000025]
subclass of: obo vocabulary:Entity

L1-L2d molt Ce [wbls:0000043]
Bio2RDF namespace: wbls
Bio2RDF identifier: 0000043
type: wbls resource [wbls_vocabulary:Resource]
in dataset: bioportal resource:bio2rdf.dataset.bioportal.R3
title: L1-L2d molt Ce
type: Class
description: The stage when an animal shifts from L1 larva to L2d larva. It includes the synthesis of new cuticle, cease of phrayngeal pumping during a lethargus stage, and the shed off of old cuticle. [wb:wjc]
part_of [obo_vocabulary:part_of]: larva Ce [wbls:0000023]
subclass of: obo vocabulary:Entity

L1-L2d lethargus Ce [wbls:0000044]
Bio2RDF namespace: wbls
Bio2RDF identifier: 0000044
type: wbls resource [wbls_vocabulary:Resource]
in dataset: bioportal resource:bio2rdf.dataset.bioportal.R3
title: L1-L2d lethargus Ce
type: Class
description: The stage during L1-L2d molt when an animal becomes lethargic, ceases pharyngeal pumping and synthesizes new cuticle under the old. [wb:wjc]
part_of [obo_vocabulary:part_of]: L1-L2d molt Ce [wbls:0000043]
subclass of: obo vocabulary:Entity

L1-L2d ecdysis Ce [wbls:0000045]
Bio2RDF namespace: wbls
Bio2RDF identifier: 0000045
type: wbls resource [wbls_vocabulary:Resource]
in dataset: bioportal resource:bio2rdf.dataset.bioportal.R3
title: L1-L2d ecdysis Ce
type: Class
description: The stage during L1-L2d molt, after the brief lethargus period, when an animal sheds off old cuticle. [wb:wjc]
part_of [obo_vocabulary:part_of]: L1-L2d molt Ce [wbls:0000043]
subclass of: obo vocabulary:Entity

L2d larva Ce [wbls:0000046]
Bio2RDF namespace: wbls
Bio2RDF identifier: 0000046
type: wbls resource [wbls_vocabulary:Resource]
in dataset: bioportal resource:bio2rdf.dataset.bioportal.R3
title: L2d larva Ce
type: Class
description: A special second stage larva with altered physiology and developmental potential that leads to formation of dauer larva. At 25 Centigrade, it ranges 25.5-32.5 hours after fertilization, 11.5-18.5 hours after hatch. [ISBN:0-87969-433-5]
part_of [obo_vocabulary:part_of]: larva Ce [wbls:0000023]
subclass of: obo vocabulary:Entity

L2-L3 ecdysis Ce [wbls:0000047]
Bio2RDF namespace: wbls
Bio2RDF identifier: 0000047
type: wbls resource [wbls_vocabulary:Resource]
in dataset: bioportal resource:bio2rdf.dataset.bioportal.R3
title: L2-L3 ecdysis Ce
type: Class
description: The stage during L2-L3 molt, after the brief lethargus period, when an animal sheds off old cuticle. [wb:wjc]
part_of [obo_vocabulary:part_of]: L2-L3 molt Ce [wbls:0000029]
starts_at_end_of [obo_vocabulary:starts_at_end_of]: L2-L3 lethargus Ce [wbls:0000028]
subclass of: obo vocabulary:Entity

L2d-dauer ecdysis Ce [wbls:0000048]
Bio2RDF namespace: wbls
Bio2RDF identifier: 0000048
type: wbls resource [wbls_vocabulary:Resource]
in dataset: bioportal resource:bio2rdf.dataset.bioportal.R3
title: L2d-dauer ecdysis Ce
type: Class
description: The stage during L2d-dauer molt, after the brief lethargus period, when an animal sheds off old cuticle. [wb:wjc]
part_of [obo_vocabulary:part_of]: L2d-dauer molt Ce [wbls:0000031]
subclass of: obo vocabulary:Entity

L3-L4 ecdysis Ce [wbls:0000049]
Bio2RDF namespace: wbls
Bio2RDF identifier: 0000049
type: wbls resource [wbls_vocabulary:Resource]
in dataset: bioportal resource:bio2rdf.dataset.bioportal.R3
title: L3-L4 ecdysis Ce
type: Class
description: The stage during L3-L4 molt, after the brief lethargus period, when an animal sheds off old cuticle. [wb:wjc]
part_of [obo_vocabulary:part_of]: L3-L4 molt Ce [wbls:0000037]
starts_at_end_of [obo_vocabulary:starts_at_end_of]: L3-L4 lethargus Ce [wbls:0000036]
subclass of: obo vocabulary:Entity

L4-adult ecdysis [wbls:0000050]
Bio2RDF namespace: wbls
Bio2RDF identifier: 0000050
type: wbls resource [wbls_vocabulary:Resource]
in dataset: bioportal resource:bio2rdf.dataset.bioportal.R3
title: L4-adult ecdysis
type: Class
description: The stage during L4-adult molt, after the brief lethargus period, when an animal shed off old cuticle. [wb:wjc]
part_of [obo_vocabulary:part_of]: L4-adult molt Ce [wbls:0000040]
starts_at_end_of [obo_vocabulary:starts_at_end_of]: L4-adult lethargus Ce [wbls:0000039]
subclass of: obo vocabulary:Entity

postdauer-L4 ecdysis Ce [wbls:0000051]
Bio2RDF namespace: wbls
Bio2RDF identifier: 0000051
type: wbls resource [wbls_vocabulary:Resource]
in dataset: bioportal resource:bio2rdf.dataset.bioportal.R3
title: postdauer-L4 ecdysis Ce
type: Class
description: The stage during postdauer-L4 molt, after the brief lethargus period, when an animal sheds off old cuticle. [wb:wjc]
part_of [obo_vocabulary:part_of]: postdauer-L4 molt Ce [wbls:0000034]
subclass of: obo vocabulary:Entity

L2d-L3 molt Ce [wbls:0000053]
Bio2RDF namespace: wbls
Bio2RDF identifier: 0000053
type: wbls resource [wbls_vocabulary:Resource]
in dataset: bioportal resource:bio2rdf.dataset.bioportal.R3
title: L2d-L3 molt Ce
type: Class
description: The stage when an animal shifts from L2d larva to L3 larva. It includes the synthesis of new cuticle, cease of phrayngeal pumping during a lethargus stage, and the shed off of old cuticle. [wb:wjc]
part_of [obo_vocabulary:part_of]: L2d larva Ce [wbls:0000046]
subclass of: obo vocabulary:Entity

L2d-L3 lethargus Ce [wbls:0000054]
Bio2RDF namespace: wbls
Bio2RDF identifier: 0000054
type: wbls resource [wbls_vocabulary:Resource]
in dataset: bioportal resource:bio2rdf.dataset.bioportal.R3
title: L2d-L3 lethargus Ce
type: Class
description: The stage during L2d-L3 molt when an animal becomes lethargic, ceases pharyngeal pumping and synthesizes new cuticle under the old. [wb:wjc]
part_of [obo_vocabulary:part_of]: L2d-L3 molt Ce [wbls:0000053]
subclass of: obo vocabulary:Entity

L2d-L3 ecdysis Ce [wbls:0000055]
Bio2RDF namespace: wbls
Bio2RDF identifier: 0000055
type: wbls resource [wbls_vocabulary:Resource]
in dataset: bioportal resource:bio2rdf.dataset.bioportal.R3
title: L2d-L3 ecdysis Ce
type: Class
description: The stage during L2d-L3 molt, after the brief lethargus period, when an animal sheds off old cuticle. [wb:wjc]
part_of [obo_vocabulary:part_of]: L2d-L3 molt Ce [wbls:0000053]
subclass of: obo vocabulary:Entity

adult male Ce [wbls:0000056]
Bio2RDF namespace: wbls
Bio2RDF identifier: 0000056
type: wbls resource [wbls_vocabulary:Resource]
in dataset: bioportal resource:bio2rdf.dataset.bioportal.R3
title: adult male Ce
type: Class
description: The stage after an male animal is fully-developed and reaches maturity. [wb:wjc]
subclass of: adult Ce [wbls:0000041]

adult hermaphrodite Ce [wbls:0000057]
Bio2RDF namespace: wbls
Bio2RDF identifier: 0000057
type: wbls resource [wbls_vocabulary:Resource]
in dataset: bioportal resource:bio2rdf.dataset.bioportal.R3
title: adult hermaphrodite Ce
type: Class
description: The stage after an hermaphrodite animal is fully-developed and reaches maturity. [wb:wjc]
subclass of: adult Ce [wbls:0000041]

pre-reproductive stage adult hermaphrodite Ce [wbls:0000058]
Bio2RDF namespace: wbls
Bio2RDF identifier: 0000058
type: wbls resource [wbls_vocabulary:Resource]
in dataset: bioportal resource:bio2rdf.dataset.bioportal.R3
title: pre-reproductive stage adult hermaphrodite Ce
type: Class
description: Very young adult hermaphrodites that do not have eggs in the uterus yet. At 20 Centigrade: 0 - 13 hours after L4-adult molt. 3 days after first cleaveage. [wb:wjc]
part_of [obo_vocabulary:part_of]: adult hermaphrodite Ce [wbls:0000057]
subclass of: obo vocabulary:Entity

reproductive stage adult hermaphrodite Ce [wbls:0000060]
Bio2RDF namespace: wbls
Bio2RDF identifier: 0000060
type: wbls resource [wbls_vocabulary:Resource]
in dataset: bioportal resource:bio2rdf.dataset.bioportal.R3
title: reproductive stage adult hermaphrodite Ce
type: Class
description: Adult hermaphrodites continuously laying fertilized eggs. Hermaphrodite in egg laying stages--usually up to 4/5 days after L4-adult molt at Centigrade. From the first fertilized egg is laid, till all sperms are used. At 20 Centigrade: 13 hours after L4-adult molt until about 5.4 days after the L4-adult molt. 3-8.4 days after first cleavage. [wb:wjc]
part_of [obo_vocabulary:part_of]: adult hermaphrodite Ce [wbls:0000057]
subclass of: obo vocabulary:Entity

oocyte-laying stage adult hermaphrodite Ce [wbls:0000061]
Bio2RDF namespace: wbls
Bio2RDF identifier: 0000061
type: wbls resource [wbls_vocabulary:Resource]
in dataset: bioportal resource:bio2rdf.dataset.bioportal.R3
title: oocyte-laying stage adult hermaphrodite Ce
type: Class
description: When egg-laying is still going on but intermittent and during which a significant number of oocytes are laid. Included in reproductive stage adult hermaphrodite. [wb:wjc]
part_of [obo_vocabulary:part_of]: adult hermaphrodite Ce [wbls:0000057]
subclass of: obo vocabulary:Entity

post-reproductive stage adult hermaphrodite Ce [wbls:0000062]
Bio2RDF namespace: wbls
Bio2RDF identifier: 0000062
type: wbls resource [wbls_vocabulary:Resource]
in dataset: bioportal resource:bio2rdf.dataset.bioportal.R3
title: post-reproductive stage adult hermaphrodite Ce
type: Class
description: Adult hermaphrodites that contain no more sperm, thus stop egg-laying, but still alive. At 20 Centigrade: 5.4 days after L4-adult molt until the death. 8.4 - 13.2 (average wild type life span) days after first cleavage. [wb:wjc]
part_of [obo_vocabulary:part_of]: adult hermaphrodite Ce [wbls:0000057]
subclass of: obo vocabulary:Entity

newly molted young adult hermaphrodite Ce [wbls:0000063]
Bio2RDF namespace: wbls
Bio2RDF identifier: 0000063
type: wbls resource [wbls_vocabulary:Resource]
in dataset: bioportal resource:bio2rdf.dataset.bioportal.R3
title: newly molted young adult hermaphrodite Ce
type: Class
description: At 20 Centigrade: 0-24 hours after L4-adult molt. [wb:wjc]
part_of [obo_vocabulary:part_of]: adult hermaphrodite Ce [wbls:0000057]
subclass of: obo vocabulary:Entity

1-day post-L4 adult hermaphrodite Ce [wbls:0000064]
Bio2RDF namespace: wbls
Bio2RDF identifier: 0000064
type: wbls resource [wbls_vocabulary:Resource]
in dataset: bioportal resource:bio2rdf.dataset.bioportal.R3
title: 1-day post-L4 adult hermaphrodite Ce
type: Class
description: At 20 Centigrade: 24-48 hours after L4-adult molt. 4-5 days after first cleavage. [wb:wjc]
part_of [obo_vocabulary:part_of]: adult hermaphrodite Ce [wbls:0000057]
subclass of: obo vocabulary:Entity

2-days post-L4 adult hermaphrodite Ce [wbls:0000065]
Bio2RDF namespace: wbls
Bio2RDF identifier: 0000065
type: wbls resource [wbls_vocabulary:Resource]
in dataset: bioportal resource:bio2rdf.dataset.bioportal.R3
title: 2-days post-L4 adult hermaphrodite Ce
type: Class
description: At 20 Centigrade: 48-72 hours after L4-adult molt. 5-6 days after first cleavage. [wb:wjc]
part_of [obo_vocabulary:part_of]: adult hermaphrodite Ce [wbls:0000057]
starts_at_end_of [obo_vocabulary:starts_at_end_of]: 1-day post-L4 adult hermaphrodite Ce [wbls:0000064]
subclass of: obo vocabulary:Entity

3-days post-L4 adult hermaphrodite Ce [wbls:0000066]
Bio2RDF namespace: wbls
Bio2RDF identifier: 0000066
type: wbls resource [wbls_vocabulary:Resource]
in dataset: bioportal resource:bio2rdf.dataset.bioportal.R3
title: 3-days post-L4 adult hermaphrodite Ce
type: Class
description: At 20 Centigrade: 72-96 hours after L4-adult molt. 6-7 days after first cleavage. [wb:wjc]
part_of [obo_vocabulary:part_of]: adult hermaphrodite Ce [wbls:0000057]
starts_at_end_of [obo_vocabulary:starts_at_end_of]: 2-days post-L4 adult hermaphrodite Ce [wbls:0000065]
subclass of: obo vocabulary:Entity

4-days post-L4 adult hermaphrodite Ce [wbls:0000067]
Bio2RDF namespace: wbls
Bio2RDF identifier: 0000067
type: wbls resource [wbls_vocabulary:Resource]
in dataset: bioportal resource:bio2rdf.dataset.bioportal.R3
title: 4-days post-L4 adult hermaphrodite Ce
type: Class
description: At 20 Centigrade: 96-120 hours after L4-adult molt. 7-8 days after first cleavage. [wb:wjc]
part_of [obo_vocabulary:part_of]: adult hermaphrodite Ce [wbls:0000057]
starts_at_end_of [obo_vocabulary:starts_at_end_of]: 3-days post-L4 adult hermaphrodite Ce [wbls:0000066]
subclass of: obo vocabulary:Entity

5-days post-L4 adult hermaphrodite Ce [wbls:0000068]
Bio2RDF namespace: wbls
Bio2RDF identifier: 0000068
type: wbls resource [wbls_vocabulary:Resource]
in dataset: bioportal resource:bio2rdf.dataset.bioportal.R3
title: 5-days post-L4 adult hermaphrodite Ce
type: Class
description: At 20 Centigrade: 5-6 days after L4-adult molt. 8-9 days after first cleavage. [wb:wjc]
part_of [obo_vocabulary:part_of]: adult hermaphrodite Ce [wbls:0000057]
starts_at_end_of [obo_vocabulary:starts_at_end_of]: 4-days post-L4 adult hermaphrodite Ce [wbls:0000067]
subclass of: obo vocabulary:Entity

4-7 days post-L4 adult hermaphrodite Ce [wbls:0000069]
Bio2RDF namespace: wbls
Bio2RDF identifier: 0000069
type: wbls resource [wbls_vocabulary:Resource]
in dataset: bioportal resource:bio2rdf.dataset.bioportal.R3
title: 4-7 days post-L4 adult hermaphrodite Ce
type: Class
description: At 20 Centigrade: 4-7 days after L4-adult molt. 7-10 days after first cleavage. [wb:wjc]
part_of [obo_vocabulary:part_of]: adult hermaphrodite Ce [wbls:0000057]
starts_at_end_of [obo_vocabulary:starts_at_end_of]: 5-days post-L4 adult hermaphrodite Ce [wbls:0000068]
subclass of: obo vocabulary:Entity

7-10 days post-L4 adult hermaphrodite Ce [wbls:0000070]
Bio2RDF namespace: wbls
Bio2RDF identifier: 0000070
type: wbls resource [wbls_vocabulary:Resource]
in dataset: bioportal resource:bio2rdf.dataset.bioportal.R3
title: 7-10 days post-L4 adult hermaphrodite Ce
type: Class
description: At 20 Centigrade: 7-10 days after L4-adult molt. 10-13 days after first cleavage. [wb:wjc]
part_of [obo_vocabulary:part_of]: adult hermaphrodite Ce [wbls:0000057]
starts_at_end_of [obo_vocabulary:starts_at_end_of]: 4-7 days post-L4 adult hermaphrodite Ce [wbls:0000069]
subclass of: obo vocabulary:Entity

8-cell embryo Ce [wbls:0000071]
Bio2RDF namespace: wbls
Bio2RDF identifier: 0000071
type: wbls resource [wbls_vocabulary:Resource]
in dataset: bioportal resource:bio2rdf.dataset.bioportal.R3
title: 8-cell embryo Ce
type: Class
description: ~50 min after first cleavage at 20 Centigrade. Contains 8 cells. [wb:wjc]
part_of [obo_vocabulary:part_of]: blastula embryo Ce [wbls:0000005]
starts_at_end_of [obo_vocabulary:starts_at_end_of]: 4-cell embryo Ce [wbls:0000008]
subclass of: obo vocabulary:Entity

12-cell embryo Ce [wbls:0000072]
Bio2RDF namespace: wbls
Bio2RDF identifier: 0000072
type: wbls resource [wbls_vocabulary:Resource]
in dataset: bioportal resource:bio2rdf.dataset.bioportal.R3
title: 12-cell embryo Ce
type: Class
description: ~55 min after first cleavage at 20 Centigrade. Contains 12 cells. [wb:wjc]
part_of [obo_vocabulary:part_of]: blastula embryo Ce [wbls:0000005]
preceded_by [obo_vocabulary:preceded_by]: 8-cell embryo Ce [wbls:0000071]
subclass of: obo vocabulary:Entity

L4 larva male Ce [wbls:0000073]
Bio2RDF namespace: wbls
Bio2RDF identifier: 0000073
type: wbls resource [wbls_vocabulary:Resource]
in dataset: bioportal resource:bio2rdf.dataset.bioportal.R3
title: L4 larva male Ce
type: Class
description: The fourth stage larva male. At 25 Centigrade, it ranges 40-49.5 hours after fertilization, 26-35.5 hours after hatch. [wb:wjc]
subclass of: L4 larva Ce [wbls:0000038]

11-15 days post-L4 adult hermaphrodite [wbls:0000074]
Bio2RDF namespace: wbls
Bio2RDF identifier: 0000074
type: wbls resource [wbls_vocabulary:Resource]
in dataset: bioportal resource:bio2rdf.dataset.bioportal.R3
title: 11-15 days post-L4 adult hermaphrodite
type: Class
description: At 20 Centigrade: 11-15 days after L4-adult molt. 14-18 days after first cleavage. [wb:dr]
part_of [obo_vocabulary:part_of]: adult hermaphrodite Ce [wbls:0000057]
starts_at_end_of [obo_vocabulary:starts_at_end_of]: 7-10 days post-L4 adult hermaphrodite Ce [wbls:0000070]
created_by [obo_vocabulary:created_by]: danielaraciti
creation_date [obo_vocabulary:creation_date]: 2012-05-22T14:35:04Z
subclass of: obo vocabulary:Entity

created_by [obo_vocabulary:created_by]
Bio2RDF namespace: obo_vocabulary
Bio2RDF identifier: created_by
type: obo_vocabulary resource [obo_vocabulary:Resource]
in dataset: bioportal resource:bio2rdf.dataset.bioportal.R3
title: created_by
type: DatatypeProperty

creation_date [obo_vocabulary:creation_date]
Bio2RDF namespace: obo_vocabulary
Bio2RDF identifier: creation_date
type: obo_vocabulary resource [obo_vocabulary:Resource]
in dataset: bioportal resource:bio2rdf.dataset.bioportal.R3
title: creation_date
type: DatatypeProperty

sheathed microfilaria Bma [wbls:0000077]
Bio2RDF namespace: wbls
Bio2RDF identifier: 0000077
type: wbls resource [wbls_vocabulary:Resource]
in dataset: bioportal resource:bio2rdf.dataset.bioportal.R3
title: sheathed microfilaria Bma
type: Class
description: Microfilaria is the stage which develops from the egg and precedes the L1 stage. The larvae are surrounded by a membrane thought to be derived from the vitelline membrane. [wb:dr&mb]
exact_synonym [obo_vocabulary:exact_synonym]: microfilaria
part_of [obo_vocabulary:part_of]: larva Bma [wbls:0000097]
created_by [obo_vocabulary:created_by]: danielaraciti
creation_date [obo_vocabulary:creation_date]: 2012-05-30T09:23:44Z
subclass of: obo vocabulary:Entity

exact_synonym [obo_vocabulary:exact_synonym]
Bio2RDF namespace: obo_vocabulary
Bio2RDF identifier: exact_synonym
type: obo_vocabulary resource [obo_vocabulary:Resource]
in dataset: bioportal resource:bio2rdf.dataset.bioportal.R3
title: exact_synonym
type: DatatypeProperty

larva Bma [wbls:0000097]
Bio2RDF namespace: wbls
Bio2RDF identifier: 0000097
type: wbls resource [wbls_vocabulary:Resource]
in dataset: bioportal resource:bio2rdf.dataset.bioportal.R3
title: larva Bma
type: Class
description: From the time after hatch till becomes adult. [WB:dr]
part_of [obo_vocabulary:part_of]: postembryonic Bma [wbls:0000093]
starts_at_end_of [obo_vocabulary:starts_at_end_of]: embryo Bma [wbls:0000092]
created_by [obo_vocabulary:created_by]: danielaraciti
creation_date [obo_vocabulary:creation_date]: 2013-11-12T05:12:19Z
subclass of: obo vocabulary:Entity

unsheathed microfilariae Bma [wbls:0000078]
Bio2RDF namespace: wbls
Bio2RDF identifier: 0000078
type: wbls resource [wbls_vocabulary:Resource]
in dataset: bioportal resource:bio2rdf.dataset.bioportal.R3
title: unsheathed microfilariae Bma
type: Class
description: In the mosquito, the microfilariae shed sheaths, penetrate the midgut, and migrate to the thoracic muscles were the microfilariae increase in size, molt, and develop into infective larvae (L1 and L3) over a span of 7-21 days. [WB:dr&mb]
part_of [obo_vocabulary:part_of]: larva Bma [wbls:0000097]
starts_at_end_of [obo_vocabulary:starts_at_end_of]: sheathed microfilaria Bma [wbls:0000077]
created_by [obo_vocabulary:created_by]: danielaraciti
creation_date [obo_vocabulary:creation_date]: 2012-05-30T09:29:01Z
subclass of: obo vocabulary:Entity

L1 larva Bma [wbls:0000079]
Bio2RDF namespace: wbls
Bio2RDF identifier: 0000079
type: wbls resource [wbls_vocabulary:Resource]
in dataset: bioportal resource:bio2rdf.dataset.bioportal.R3
title: L1 larva Bma
type: Class
description: The first stage larva. [WB:dr&mb]
part_of [obo_vocabulary:part_of]: larva Bma [wbls:0000097]
starts_at_end_of [obo_vocabulary:starts_at_end_of]: unsheathed microfilariae Bma [wbls:0000078]
created_by [obo_vocabulary:created_by]: danielaraciti
creation_date [obo_vocabulary:creation_date]: 2012-05-30T09:29:36Z
subclass of: obo vocabulary:Entity

L2 larva Bma [wbls:0000080]
Bio2RDF namespace: wbls
Bio2RDF identifier: 0000080
type: wbls resource [wbls_vocabulary:Resource]
in dataset: bioportal resource:bio2rdf.dataset.bioportal.R3
title: L2 larva Bma
type: Class
description: The second stage larva. Derived from flight muscles of vector host; some development in vitro, with L1 to L2 moulting, has been demonstrated but rarely; these are often staged by hours or days post blood meal. [wb:dr&mb]
part_of [obo_vocabulary:part_of]: larva Bma [wbls:0000097]
starts_at_end_of [obo_vocabulary:starts_at_end_of]: L1 larva Bma [wbls:0000079]
created_by [obo_vocabulary:created_by]: danielaraciti
creation_date [obo_vocabulary:creation_date]: 2012-05-30T09:30:40Z
subclass of: obo vocabulary:Entity

L3 larva Bma [wbls:0000081]
Bio2RDF namespace: wbls
Bio2RDF identifier: 0000081
type: wbls resource [wbls_vocabulary:Resource]
in dataset: bioportal resource:bio2rdf.dataset.bioportal.R3
title: L3 larva Bma
type: Class
description: The third stage larva. [wb:dr&mb]
part_of [obo_vocabulary:part_of]: larva Bma [wbls:0000097]
starts_at_end_of [obo_vocabulary:starts_at_end_of]: L2 larva Bma [wbls:0000080]
created_by [obo_vocabulary:created_by]: danielaraciti
creation_date [obo_vocabulary:creation_date]: 2012-05-30T09:31:06Z
subclass of: obo vocabulary:Entity

L4 larva Bma [wbls:0000082]
Bio2RDF namespace: wbls
Bio2RDF identifier: 0000082
type: wbls resource [wbls_vocabulary:Resource]
in dataset: bioportal resource:bio2rdf.dataset.bioportal.R3
title: L4 larva Bma
type: Class
description: The fourth stage larva. Should be conditioned by days post infection; as moulting is not synchronous, some samples are defined as L3/L4, indicating a mix of individuals as late L3, moulting, and early L4. [wb:dr&mb]
part_of [obo_vocabulary:part_of]: larva Bma [wbls:0000097]
starts_at_end_of [obo_vocabulary:starts_at_end_of]: L3 larva Bma [wbls:0000081]
created_by [obo_vocabulary:created_by]: danielaraciti
creation_date [obo_vocabulary:creation_date]: 2012-05-30T09:31:38Z
subclass of: obo vocabulary:Entity

adult Bma [wbls:0000083]
Bio2RDF namespace: wbls
Bio2RDF identifier: 0000083
type: wbls resource [wbls_vocabulary:Resource]
in dataset: bioportal resource:bio2rdf.dataset.bioportal.R3
title: adult Bma
type: Class
description: Adults (or at least adult females) can live for 10 years in a human host, and can outlive their rodent laboratory hosts; it is usual to state the chronological age of the nematodes in days or months post-infection, and occasionally post-patency (the production of first microfilariae). [WB:dr&mb]
part_of [obo_vocabulary:part_of]: postembryonic Bma [wbls:0000093]
starts_at_end_of [obo_vocabulary:starts_at_end_of]: young adult Bma [wbls:0000100]
created_by [obo_vocabulary:created_by]: danielaraciti
creation_date [obo_vocabulary:creation_date]: 2012-05-30T09:32:18Z
subclass of: obo vocabulary:Entity

postembryonic Bma [wbls:0000093]
Bio2RDF namespace: wbls
Bio2RDF identifier: 0000093
type: wbls resource [wbls_vocabulary:Resource]
in dataset: bioportal resource:bio2rdf.dataset.bioportal.R3
title: postembryonic Bma
type: Class
description: The stage after hatch till death. [WB:dr]
subclass of: all stages Bma [wbls:0000091]
starts_at_end_of [obo_vocabulary:starts_at_end_of]: embryo Bma [wbls:0000092]
created_by [obo_vocabulary:created_by]: danielaraciti
creation_date [obo_vocabulary:creation_date]: 2013-11-12T04:50:29Z

young adult Bma [wbls:0000100]
Bio2RDF namespace: wbls
Bio2RDF identifier: 0000100
type: wbls resource [wbls_vocabulary:Resource]
in dataset: bioportal resource:bio2rdf.dataset.bioportal.R3
title: young adult Bma
type: Class
description: The animals have a significant prepatent period in the host, where they have moulted to adults but not yet started producing eggs or sperm; this stage is usually-should be conditioned by days post infection, with day 26 to approximately day 60 being the young adult in most systems - but note that the speed of development is different in different host genotypes. [wb:dr&mb]
part_of [obo_vocabulary:part_of]: postembryonic Bma [wbls:0000093]
starts_at_end_of [obo_vocabulary:starts_at_end_of]: L4 larva Bma [wbls:0000082]
created_by [obo_vocabulary:created_by]: danielaraciti
creation_date [obo_vocabulary:creation_date]: 2013-11-12T05:37:52Z
subclass of: obo vocabulary:Entity

14-cell embryo Ce [wbls:0000084]
Bio2RDF namespace: wbls
Bio2RDF identifier: 0000084
type: wbls resource [wbls_vocabulary:Resource]
in dataset: bioportal resource:bio2rdf.dataset.bioportal.R3
title: 14-cell embryo Ce
type: Class
description: E-cell has divided into Ea and Ep. Contains 14 cells. [wb:dr]
comment [obo_vocabulary:comment]: Levin M, Hashimshony T, Wagner F, Yanai I. Developmental milestones punctuate gene expression in the Caenorhabditis embryo. Dev Cell. 2012 May 15;22(5):1101-8. Epub 2012 May 3. PubMed PMID: 22560298. Supplementary table 1.
part_of [obo_vocabulary:part_of]: blastula embryo Ce [wbls:0000005]
preceded_by [obo_vocabulary:preceded_by]: 12-cell embryo Ce [wbls:0000072]
created_by [obo_vocabulary:created_by]: danielaraciti
creation_date [obo_vocabulary:creation_date]: 2012-10-02T17:15:41Z
subclass of: obo vocabulary:Entity

comment [obo_vocabulary:comment]
Bio2RDF namespace: obo_vocabulary
Bio2RDF identifier: comment
type: obo_vocabulary resource [obo_vocabulary:Resource]
in dataset: bioportal resource:bio2rdf.dataset.bioportal.R3
title: comment
type: DatatypeProperty

24-cell embryo Ce [wbls:0000085]
Bio2RDF namespace: wbls
Bio2RDF identifier: 0000085
type: wbls resource [wbls_vocabulary:Resource]
in dataset: bioportal resource:bio2rdf.dataset.bioportal.R3
title: 24-cell embryo Ce
type: Class
description: Fourth cleavage of the AB lineage. Contains 24 cells. [wb:dr]
comment [obo_vocabulary:comment]: Levin M, Hashimshony T, Wagner F, Yanai I. Developmental milestones punctuate gene expression in the Caenorhabditis embryo. Dev Cell. 2012 May 15;22(5):1101-8. Epub 2012 May 3. PubMed PMID: 22560298. Supplementary table 1.
part_of [obo_vocabulary:part_of]: blastula embryo Ce [wbls:0000005]
preceded_by [obo_vocabulary:preceded_by]: 14-cell embryo Ce [wbls:0000084]
created_by [obo_vocabulary:created_by]: danielaraciti
creation_date [obo_vocabulary:creation_date]: 2012-10-02T17:23:32Z
subclass of: obo vocabulary:Entity

68-cell embryo Ce [wbls:0000087]
Bio2RDF namespace: wbls
Bio2RDF identifier: 0000087
type: wbls resource [wbls_vocabulary:Resource]
in dataset: bioportal resource:bio2rdf.dataset.bioportal.R3
title: 68-cell embryo Ce
type: Class
description: Sixth cleavage of the AB lineage. Contains 68 cells. [wb:dr]
comment [obo_vocabulary:comment]: Levin M, Hashimshony T, Wagner F, Yanai I. Developmental milestones punctuate gene expression in the Caenorhabditis embryo. Dev Cell. 2012 May 15;22(5):1101-8. Epub 2012 May 3. PubMed PMID: 22560298. Supplementary table 1.
part_of [obo_vocabulary:part_of]: gastrulating embryo Ce [wbls:0000010]
preceded_by [obo_vocabulary:preceded_by]: 51-cell embryo Ce [wbls:0000011]
created_by [obo_vocabulary:created_by]: danielaraciti
creation_date [obo_vocabulary:creation_date]: 2012-10-02T17:26:52Z
subclass of: obo vocabulary:Entity

190-cells embryo Ce [wbls:0000089]
Bio2RDF namespace: wbls
Bio2RDF identifier: 0000089
type: wbls resource [wbls_vocabulary:Resource]
in dataset: bioportal resource:bio2rdf.dataset.bioportal.R3
title: 190-cells embryo Ce
type: Class
description: P4 and M cells have finished migrating. Contains 190 cells. [wb:dr]
part_of [obo_vocabulary:part_of]: gastrulating embryo Ce [wbls:0000010]
preceded_by [obo_vocabulary:preceded_by]: 96-cell embryo Ce [wbls:0000090]
created_by [obo_vocabulary:created_by]: danielaraciti
creation_date [obo_vocabulary:creation_date]: 2012-10-15T13:19:10Z
subclass of: obo vocabulary:Entity

96-cell embryo Ce [wbls:0000090]
Bio2RDF namespace: wbls
Bio2RDF identifier: 0000090
type: wbls resource [wbls_vocabulary:Resource]
in dataset: bioportal resource:bio2rdf.dataset.bioportal.R3
title: 96-cell embryo Ce
type: Class
description: 155-165 min after first cleavage at 20 Centigrade. Contains 96 cells. [wb:dr]
part_of [obo_vocabulary:part_of]: gastrulating embryo Ce [wbls:0000010]
preceded_by [obo_vocabulary:preceded_by]: 88-cell embryo Ce [wbls:0000012]
created_by [obo_vocabulary:created_by]: danielaraciti
creation_date [obo_vocabulary:creation_date]: 2012-10-16T15:37:30Z
subclass of: obo vocabulary:Entity

all stages Bma [wbls:0000091]
Bio2RDF namespace: wbls
Bio2RDF identifier: 0000091
type: wbls resource [wbls_vocabulary:Resource]
in dataset: bioportal resource:bio2rdf.dataset.bioportal.R3
title: all stages Bma
type: Class
description: All B. malayi developmental stages, including embryo, larva and adult stage. [wb:dr&mb]
subclass of: Nematoda Life Stage [wbls:0000075]
created_by [obo_vocabulary:created_by]: danielaraciti
creation_date [obo_vocabulary:creation_date]: 2013-11-12T03:18:57Z

embryo Bma [wbls:0000092]
Bio2RDF namespace: wbls
Bio2RDF identifier: 0000092
type: wbls resource [wbls_vocabulary:Resource]
in dataset: bioportal resource:bio2rdf.dataset.bioportal.R3
title: embryo Bma
type: Class
description: The whole period of embryogenesis, from the formation of an egg till its hatch. [WB:dr]
subclass of: all stages Bma [wbls:0000091]
created_by [obo_vocabulary:created_by]: danielaraciti
creation_date [obo_vocabulary:creation_date]: 2013-11-12T04:48:28Z

early embryo Bma [wbls:0000094]
Bio2RDF namespace: wbls
Bio2RDF identifier: 0000094
type: wbls resource [wbls_vocabulary:Resource]
in dataset: bioportal resource:bio2rdf.dataset.bioportal.R3
title: early embryo Bma
type: Class
description: Proliferates from 1 to 100 cells. As the Brugia female reproductive tract is long (>10 cm), it is possible to dissect it and select early embryos just by isolating early parts of the post-spermatheca uterus. [WB:dr&mb]
part_of [obo_vocabulary:part_of]: embryo Bma [wbls:0000092]
created_by [obo_vocabulary:created_by]: danielaraciti
creation_date [obo_vocabulary:creation_date]: 2013-11-12T04:55:53Z
subclass of: obo vocabulary:Entity

middle embryo Bma [wbls:0000095]
Bio2RDF namespace: wbls
Bio2RDF identifier: 0000095
type: wbls resource [wbls_vocabulary:Resource]
in dataset: bioportal resource:bio2rdf.dataset.bioportal.R3
title: middle embryo Bma
type: Class
description: Proliferates from 100 cells to Lima bean stage. [WB:dr&mb]
part_of [obo_vocabulary:part_of]: embryo Bma [wbls:0000092]
starts_at_end_of [obo_vocabulary:starts_at_end_of]: early embryo Bma [wbls:0000094]
created_by [obo_vocabulary:created_by]: danielaraciti
creation_date [obo_vocabulary:creation_date]: 2013-11-12T04:59:19Z
subclass of: obo vocabulary:Entity

late embryo Bma [wbls:0000096]
Bio2RDF namespace: wbls
Bio2RDF identifier: 0000096
type: wbls resource [wbls_vocabulary:Resource]
in dataset: bioportal resource:bio2rdf.dataset.bioportal.R3
title: late embryo Bma
type: Class
description: From Lima bean to hatching. [WB:dr&mb]
part_of [obo_vocabulary:part_of]: embryo Bma [wbls:0000092]
starts_at_end_of [obo_vocabulary:starts_at_end_of]: middle embryo Bma [wbls:0000095]
created_by [obo_vocabulary:created_by]: danielaraciti
creation_date [obo_vocabulary:creation_date]: 2013-11-12T05:00:28Z
subclass of: obo vocabulary:Entity

vector-derived L3 Bma [wbls:0000098]
Bio2RDF namespace: wbls
Bio2RDF identifier: 0000098
type: wbls resource [wbls_vocabulary:Resource]
in dataset: bioportal resource:bio2rdf.dataset.bioportal.R3
title: vector-derived L3 Bma
type: Class
description: Also known as infective L3, or iL3; i.e. isolated from the vector salivary glands; these samples may-should be conditioned by age, which is usually counted in days from the blood meal. [wb:dr&mb]
related_synonym [obo_vocabulary:related_synonym]: iL3
related_synonym [obo_vocabulary:related_synonym]: infective L3
part_of [obo_vocabulary:part_of]: L3 larva Bma [wbls:0000081]
created_by [obo_vocabulary:created_by]: danielaraciti
creation_date [obo_vocabulary:creation_date]: 2013-11-12T05:23:54Z
subclass of: obo vocabulary:Entity

related_synonym [obo_vocabulary:related_synonym]
Bio2RDF namespace: obo_vocabulary
Bio2RDF identifier: related_synonym
type: obo_vocabulary resource [obo_vocabulary:Resource]
in dataset: bioportal resource:bio2rdf.dataset.bioportal.R3
title: related_synonym
type: DatatypeProperty

post-infection L3 Bma [wbls:0000099]
Bio2RDF namespace: wbls
Bio2RDF identifier: 0000099
type: wbls resource [wbls_vocabulary:Resource]
in dataset: bioportal resource:bio2rdf.dataset.bioportal.R3
title: post-infection L3 Bma
type: Class
description: Derived from the host after reintroduction by vector feeding or manual inoculation; these piL3 samples are often-should be conditioned by age (hours or days post-infection). [wb:dr&mb]
related_synonym [obo_vocabulary:related_synonym]: piL3
part_of [obo_vocabulary:part_of]: L3 larva Bma [wbls:0000081]
created_by [obo_vocabulary:created_by]: danielaraciti
creation_date [obo_vocabulary:creation_date]: 2013-11-12T05:24:59Z
subclass of: obo vocabulary:Entity

all stages nematode [wbls:0000101]
Bio2RDF namespace: wbls
Bio2RDF identifier: 0000101
type: wbls resource [wbls_vocabulary:Resource]
in dataset: bioportal resource:bio2rdf.dataset.bioportal.R3
title: all stages nematode
type: Class
description: All developmental stages, including embryo, larva and adult stage. [wb:dr]
subclass of: Nematoda Life Stage [wbls:0000075]
created_by [obo_vocabulary:created_by]: danielaraciti
creation_date [obo_vocabulary:creation_date]: 2013-11-25T06:13:37Z

embryo nematode [wbls:0000102]
Bio2RDF namespace: wbls
Bio2RDF identifier: 0000102
type: wbls resource [wbls_vocabulary:Resource]
in dataset: bioportal resource:bio2rdf.dataset.bioportal.R3
title: embryo nematode
type: Class
description: The whole period of embryogenesis, from the formation of an egg till its hatch. [wb:dr]
subclass of: all stages nematode [wbls:0000101]
created_by [obo_vocabulary:created_by]: danielaraciti
creation_date [obo_vocabulary:creation_date]: 2013-11-25T06:14:14Z

postembryonic nematode [wbls:0000103]
Bio2RDF namespace: wbls
Bio2RDF identifier: 0000103
type: wbls resource [wbls_vocabulary:Resource]
in dataset: bioportal resource:bio2rdf.dataset.bioportal.R3
title: postembryonic nematode
type: Class
description: The stage after hatch till death. [wb:dr]
subclass of: all stages nematode [wbls:0000101]
starts_at_end_of [obo_vocabulary:starts_at_end_of]: embryo nematode [wbls:0000102]
created_by [obo_vocabulary:created_by]: danielaraciti
creation_date [obo_vocabulary:creation_date]: 2013-11-25T06:14:39Z

adult nematode [wbls:0000104]
Bio2RDF namespace: wbls
Bio2RDF identifier: 0000104
type: wbls resource [wbls_vocabulary:Resource]
in dataset: bioportal resource:bio2rdf.dataset.bioportal.R3
title: adult nematode
type: Class
description: The stage after an animal is fully-developed and reaches maturity. [wb:dr]
part_of [obo_vocabulary:part_of]: postembryonic nematode [wbls:0000103]
starts_at_end_of [obo_vocabulary:starts_at_end_of]: larva nematode [wbls:0000105]
created_by [obo_vocabulary:created_by]: danielaraciti
creation_date [obo_vocabulary:creation_date]: 2013-11-25T06:18:53Z
subclass of: obo vocabulary:Entity

larva nematode [wbls:0000105]
Bio2RDF namespace: wbls
Bio2RDF identifier: 0000105
type: wbls resource [wbls_vocabulary:Resource]
in dataset: bioportal resource:bio2rdf.dataset.bioportal.R3
title: larva nematode
type: Class
description: From the time after hatch till becomes adult. [wb:dr]
part_of [obo_vocabulary:part_of]: postembryonic nematode [wbls:0000103]
created_by [obo_vocabulary:created_by]: danielaraciti
creation_date [obo_vocabulary:creation_date]: 2013-11-25T06:19:27Z
subclass of: obo vocabulary:Entity

L1 larva nematode [wbls:0000106]
Bio2RDF namespace: wbls
Bio2RDF identifier: 0000106
type: wbls resource [wbls_vocabulary:Resource]
in dataset: bioportal resource:bio2rdf.dataset.bioportal.R3
title: L1 larva nematode
type: Class
description: The first stage larva. [wb:dr]
part_of [obo_vocabulary:part_of]: larva nematode [wbls:0000105]
starts_at_end_of [obo_vocabulary:starts_at_end_of]: sheathed microfilaria nematode [wbls:0000110]
created_by [obo_vocabulary:created_by]: danielaraciti
creation_date [obo_vocabulary:creation_date]: 2013-11-25T06:20:28Z
subclass of: obo vocabulary:Entity

sheathed microfilaria nematode [wbls:0000110]
Bio2RDF namespace: wbls
Bio2RDF identifier: 0000110
type: wbls resource [wbls_vocabulary:Resource]
in dataset: bioportal resource:bio2rdf.dataset.bioportal.R3
title: sheathed microfilaria nematode
type: Class
description: Microfilaria is the stage which develops from the egg and precedes the L1 stage. The larvae are surrounded by a membrane thought to be derived from the vitelline membrane. [wb:dr]
part_of [obo_vocabulary:part_of]: larva nematode [wbls:0000105]
created_by [obo_vocabulary:created_by]: danielaraciti
creation_date [obo_vocabulary:creation_date]: 2013-11-25T06:23:23Z
subclass of: obo vocabulary:Entity

L2 larva nematode [wbls:0000107]
Bio2RDF namespace: wbls
Bio2RDF identifier: 0000107
type: wbls resource [wbls_vocabulary:Resource]
in dataset: bioportal resource:bio2rdf.dataset.bioportal.R3
title: L2 larva nematode
type: Class
description: The second stage larva. [wb:dr]
part_of [obo_vocabulary:part_of]: larva nematode [wbls:0000105]
starts_at_end_of [obo_vocabulary:starts_at_end_of]: L1 larva nematode [wbls:0000106]
created_by [obo_vocabulary:created_by]: danielaraciti
creation_date [obo_vocabulary:creation_date]: 2013-11-25T06:20:54Z
subclass of: obo vocabulary:Entity

L3 larva nematode [wbls:0000108]
Bio2RDF namespace: wbls
Bio2RDF identifier: 0000108
type: wbls resource [wbls_vocabulary:Resource]
in dataset: bioportal resource:bio2rdf.dataset.bioportal.R3
title: L3 larva nematode
type: Class
description: The third stage larva. [wb:dr]
part_of [obo_vocabulary:part_of]: larva nematode [wbls:0000105]
starts_at_end_of [obo_vocabulary:starts_at_end_of]: L2 larva nematode [wbls:0000107]
created_by [obo_vocabulary:created_by]: danielaraciti
creation_date [obo_vocabulary:creation_date]: 2013-11-25T06:21:33Z
subclass of: obo vocabulary:Entity

L4 larva nematode [wbls:0000109]
Bio2RDF namespace: wbls
Bio2RDF identifier: 0000109
type: wbls resource [wbls_vocabulary:Resource]
in dataset: bioportal resource:bio2rdf.dataset.bioportal.R3
title: L4 larva nematode
type: Class
description: The fourth stage larva. [wb:dr]
part_of [obo_vocabulary:part_of]: larva nematode [wbls:0000105]
starts_at_end_of [obo_vocabulary:starts_at_end_of]: L3 larva nematode [wbls:0000108]
created_by [obo_vocabulary:created_by]: danielaraciti
creation_date [obo_vocabulary:creation_date]: 2013-11-25T06:22:48Z
subclass of: obo vocabulary:Entity

16-18 days post-L4 adult hermaphrodite Ce [wbls:0000111]
Bio2RDF namespace: wbls
Bio2RDF identifier: 0000111
type: wbls resource [wbls_vocabulary:Resource]
in dataset: bioportal resource:bio2rdf.dataset.bioportal.R3
title: 16-18 days post-L4 adult hermaphrodite Ce
type: Class
description: At 20 Centigrade: 16-18 days after L4-adult molt. 18-21 days after first cleavage. [wb:dr]
part_of [obo_vocabulary:part_of]: adult hermaphrodite Ce [wbls:0000057]
starts_at_end_of [obo_vocabulary:starts_at_end_of]: 11-15 days post-L4 adult hermaphrodite [wbls:0000074]
created_by [obo_vocabulary:created_by]: danielaraciti

part_of [obo:part_of]
Bio2RDF namespace: obo
Bio2RDF identifier: part_of
type: obo_vocabulary resource [obo_vocabulary:Resource]
in dataset: bioportal resource:bio2rdf.dataset.bioportal.R3
title: part_of
type: Class
xref [obo_vocabulary:xref]: BFO:0000050
is_transitive [obo_vocabulary:is_transitive]: true

xref [obo_vocabulary:xref]
Bio2RDF namespace: obo_vocabulary
Bio2RDF identifier: xref
type: obo_vocabulary resource [obo_vocabulary:Resource]
in dataset: bioportal resource:bio2rdf.dataset.bioportal.R3
title: xref
type: DatatypeProperty

is_transitive [obo_vocabulary:is_transitive]
Bio2RDF namespace: obo_vocabulary
Bio2RDF identifier: is_transitive
type: obo_vocabulary resource [obo_vocabulary:Resource]
in dataset: bioportal resource:bio2rdf.dataset.bioportal.R3
title: is_transitive
type: DatatypeProperty

preceded_by [obo:preceded_by]
Bio2RDF namespace: obo
Bio2RDF identifier: preceded_by
type: obo_vocabulary resource [obo_vocabulary:Resource]
in dataset: bioportal resource:bio2rdf.dataset.bioportal.R3
title: preceded_by
type: Class
xref [obo_vocabulary:xref]: BFO:0000062
is_transitive [obo_vocabulary:is_transitive]: true

starts_at_end_of [obo:starts_at_end_of]
Bio2RDF namespace: obo
Bio2RDF identifier: starts_at_end_of
type: obo_vocabulary resource [obo_vocabulary:Resource]
in dataset: bioportal resource:bio2rdf.dataset.bioportal.R3
title: starts_at_end_of
type: Class
sub property of: preceded_by [obo_vocabulary:preceded_by]
xref [obo_vocabulary:xref]: RO:0002087