MiddleSchoolStudent
type: Class
definition: Middle schools students are students coursing between the fourth or fifth year of schooling up to the eighth or ninth year, although this may vary.
subclass of: Student
definitionSource: adapted from: http://en.wikipedia.org/wiki/Middle_school

definition

Student
type: Class
importedFrom: SNOMED Clinical Terms.
subclass of: Occupation
alternativeTerm: Student (occupation) Student, NOS
definition: Is a Worker not reporting any occupation. Is a person in the educational environment.

definitionSource

veteran
type: Class
subclass of: person
definition: person who has served in a military force, especially during a war.
importedFrom: CRISP thesaurus, 2006

person
type: Class
definition: A human being.
importedFrom: NCI thesaurus
definitionSource: NICHD BRIDG
alternativeTerm: Individual

importedFrom

navy member
type: Class
definition: person who is part of the navy
subclass of: person

structured clinical interview for the DSM-II
type: Class
subclass of: symptom specific assessment tool
definitionSource: First, Spitzer, Gibbon, & Williams, 1995
alternativeTerm: SCID-II
definition: The Structured Clinical Interview for DSM-II Axis II Disorder (SCID-II) is a diagnostic exam used to determine DSM-II Axis II disorders (personality disorders).

symptom specific assessment tool
type: Class
subclass of: clinical psychology assessment tool
importedFrom: NCI thesaurus
definition: Any one of several evaluation/assessment tools used to ascertain a patient's complaints with regard to his or her specific condition or diagnosis.

alternativeTerm

Attempt
type: Class
definition: An activity intended to do or accomplish something. Routinely used as in "number of tries to complete a procedure".
importedFrom: NCI Thesaurus
subclass of: Action

Action
type: Class
alternativeTerm: Generic Action
subclass of: activity
definition: A thing done.
importedFrom: NCI Thesaurus

activity
type: Class
definition: An active process; excludes processes and mechanisms which fulfill biological functions.
importedFrom: NCI thesaurus

Male homosexual
type: Class
alternativeTerm: Male homosexual state Male homosexuality Male homosexual (finding)
subclass of: Homosexual

Homosexual
type: Class
alternativeTerm: homosexuality gay (sexual orientation) lesbian
importedFrom: CRISP thesaurus, 2006
subclass of: SexualOrientation
definition: sexual attraction or relationship between members of the same sex.

never married
type: Class
definition: Indicates a person who has never been married or whose marriages have been annulled.
importedFrom: NCI thesaurus
alternativeTerm: Never Married Status
subclass of: marital status

marital status
type: Class
definition: A demographic parameter indicating a person's current conjugal status.
importedFrom: NCI thesaurus
subclass of: personal attribute
alternativeTerm: MARISTAT MaritalStatusUB92

adjustment disorder
type: Class
importedFrom: NCI thesaurus
subclass of: psychiatric disorder
subclass of: suicido resource:arce6c6b1
definition: A category of psychiatric disorders which are characterized by emotional or behavioral symptoms that develop within 3 months of a stressor and do not persist for more than an additional 6 months after the stressor is no longer present.

psychiatric disorder
type: Class
importedFrom: NCI thesaurus
definition: A disorder characterized by behavioral and/or psychological abnormalities, often accompanied by physical symptoms. The symptoms may cause clinically significant distress or impairment in social and occupational areas of functioning. Representative examples include anxiety disorders, cognitive disorders, mood disorders and schizophrenia.
subclass of: diseases or disorders
alternativeTerm: Psychiatric Disease Mental Illness PSYCHIATRIC DISORDERS Mental Dysfunction

percentage distribution
type: Class
definitionSource: http://encyclopedia2.thefreedictionary.com/percentage+distribution
alternativeTerm: relative frequency distribution relative frequency table.
subclass of: percentage
definition: A frequency distribution in which the individual class frequencies are expressed as a percentage of the total frequency equated to 100.

hasPercentageDistribution
type: ObjectProperty

sleep disorder
type: Class
importedFrom: NCI thesaurus
alternativeTerm: SLEEP DISTURBANCES Sleep Disturbance DISTURBANCES, SLEEP parasomnia
definition: A change from the patient's baseline sleeping pattern, either an increase or a decrease in the number of hours slept. This can also refer to alterations in the stages of sleep.
definitionSource: NICHD FDA
subclass of: suicido resource:arce6c6b2
subclass of: psychiatric disorder

African
type: Class
importedFrom: NCI Thesaurus
definition: Denotes a person with African ancestral origins who self identifies, or is identified, as African. The concept does not refer to those of other ancestry, for example, European and South Asian. In practice, the term mainly refers to people originated from forty-eight sub-Saharan Africa nations; and excudes individuals from North Africa countries, e.g. such as Algeria, Morocco, Egypt, Tunisia with Arab and Berber ethnicity.
subclass of: ethnic group

ethnic group
type: Class
importedFrom: Experimental Factor Ontology (EFO)
definitionSource: NIFSTD:birnlex_3016
subclass of: population group
definition: A group of people with a common cultural heritage that sets them apart from others in a variety of social relationships. (MSH); A social group characterized by a distinctive social and cultural tradition maintained from generation to generation, a common history and origin and a sense of identification with the group; members of the group have distinctive features in their way of life, shared experiences and often a common genetic heritage; these features may be reflected in their experience of health and disease. (NCI); Ethnicity - an arbitrary classification of the social group a person belongs to, and either identifies with or is identified with by others, as a result of a complex of cultural, biological, geographical and other factors such as linguistic, dietary and religion traditions; ancestry, background, allegiance, or association; and physical characteristics traditionally associated with race. Increasingly the concept is used synonymously with race but this use trend has a pragmatic basis rather than scientific. (NCI); The concept of ethnic origin is an attempt to classify people, not according to their current ethnicity, but according to where their ancestors came from. Ethnic origin has become a popular classification in statistics, where the concept of race has been largely discarded. (from Wikipedia) (NCI); a group of people with a common cultural heritage that sets them apart from others in a variety of social relationships. (CSP)
alternativeTerm: Ethnicity race

sign or symptom
type: Class
definitionSource: CDISC NICHD
importedFrom: NCI thesaurus
alternativeTerm: Clinical Finding DESC Signs or Symptoms CLINICAL SIGNS
definition: Objective evidence of disease perceptible to the examining practitioner (sign) and subjective evidence of disease perceived by the patient (symptom).
subclass of: finding

finding
type: Class
importedFrom: NCI thesaurus
subclass of: disease, disorder or finding
definition: Clinical, laboratory or molecular evidence, or absence of evidence of disease.

author
type: Class
subclass of: person

department of the army
type: Class
definitionSource: http://en.wikipedia.org/wiki/United_States_Department_of_the_Army
alternativeTerm: DA
subclass of: suicido resource:arce6c6b3
subclass of: department of defense
definition: The Department of the Army (DA) is one of the three military departments within the Department of Defense of the United States of America.

department of defense
type: Class
definitionSource: http://en.wikipedia.org/wiki/United_States_Department_of_Defense#Military_Departments
alternativeTerm: Defense Department USDOD DOD DoD the Pentagon
importedFrom: NCI thesaurus
subclass of: professional organization

GeriatricSuicideIdeationScale
type: Class
definitionSource: Heisel and Flett, 2006
subclass of: symptom specific assessment tool
definition: GSIS a new multidimensional measure of suicide ideation and related factors in older adults.
alternativeTerm: GSIS

divorced
type: Class
importedFrom: NCI thesaurus
definition: Indicates a person whose marriage has been legally dissolved and has not remarried.
subclass of: marital status
alternativeTerm: Divorced Status

lives with others
type: Class
subclass of: household composition

household composition
type: Class
subclass of: personal attribute
importedFrom: Read Codes, Clinical Terms Version 3 (CTV3)
alternativeTerm: Lives with LW - Lives with

anxiety disorder
type: Class
alternativeTerm: Anxiety
importedFrom: NCI thesaurus
subclass of: psychiatric disorder
subclass of: suicido resource:arce6c6b4
definition: A category of psychiatric disorders which are characterized by anxious feelings or fear often accompanied by physical symptoms associated with anxiety.

department of the navy
type: Class
definitionSource: http://www.thefreedictionary.com/Department+of+the+Navy
subclass of: suicido resource:arce6c6b5
subclass of: department of defense
alternativeTerm: DON
definition: The executive part of the Department of the Navy at the seat of government; the headquarters, US Marine Corps; the entire operating forces of the United States Navy and of the US Marine Corps, including the Reserve Components of such forces; all field activities, headquarters, forces, bases, installations, activities, and functions under the control or supervision of the Secretary of the Navy; and the US Coast Guard when operating as a part of the Navy pursuant to law.

paykel scale
type: Class
subclass of: symptom specific assessment tool
definition: paykel scale is used to evaluate stressful life events

CollegeStudent
type: Class
importedFrom: Neuroscience Information Framework Standard Ontology
subclass of: Student

locality
type: Class
definition: A location known by a local name (e.g., neighborhood, place, or district).
importedFrom: NCI thesaurus
subclass of: geographic area

geographic area
type: Class
importedFrom: NCI thesaurus
alternativeTerm: Area Region Geographic Location Geographic Region
definition: Any demarcated area of the Earth; may be determined by both natural and human boundaries.

anxiety
type: Class
importedFrom: NCI thesaurus
definition: Apprehension of danger and dread accompanied by restlessness, tension, tachycardia, and dyspnea unattached to a clearly identifiable stimulus.
subclass of: mental and behavioral signs and symptoms

mental and behavioral signs and symptoms
type: Class
definition: Clinical evidence of disease resulting from mental and/or behavioral dysfunction.
subclass of: sign or symptom
importedFrom: NCI thesaurus

mini international neuropsychiatric interview
type: Class
definition: The Mini-international neuropsychiatric interview is a short structured clinical interview which enables researchers to make diagnoses of psychiatric disorders according to DSM-IV (Diagnostic and Statistical Manual of Mental Disorders) or ICD-10. The administration time of the interview is approximately 15 minutes and was designed for epidemiological studies and multicenter clinical trials.
importedFrom: Experimental Factor Ontology (EFO)
subclass of: symptom specific assessment tool
subclass of: suicido resource:arce6c6b6
subclass of: suicido resource:arce6c6b7
subclass of: suicido resource:arce6c6b8
subclass of: suicido resource:arce6c6b9
subclass of: suicido resource:arce6c6b10
definitionSource: http://en.wikipedia.org/wiki/Mini-international_neuropsychiatric_interview

measures
type: ObjectProperty
domain: diagnostic or prognostic test
range: suicido resource:arce6c6b59

psychosis
type: Class
importedFrom: NCI thesaurus
definition: A mental disorder characterized by personality change, impaired functioning, and loss of touch with reality. It may be a manifestation of schizophrenia, bipolar disorder, or brain tumor.
subclass of: schizophrenia and other psychotic disorders

alcohol abuse
type: Class
subclass of: substance abuse
importedFrom: NCI thesaurus
alternativeTerm: alcohol misuse
definition: The use of alcoholic beverages to excess, either on individual occasions ("binge drinking") or as a regular practice.

mania
type: Class
importedFrom: NCI thesaurus
subclass of: mood disorder
alternativeTerm: Manic State Manic
definition: Excitement of psychotic proportions manifested by mental and physical hyperactivity, disorganisation of behaviour and elevation of mood.

panic
type: Class
subclass of: mental and behavioral signs and symptoms
importedFrom: NCI thesaurus
definition: Sudden extreme anxiety or fear that may cause irrational thoughts or actions. Panic may include rapid heart rate, flushing (a hot, red face), sweating, and trouble breathing.
definitionSource: NCI-GLOSS

GeneralQualifier
type: Class
subclass of: qualifier
definition: A term that helps define and render another concept unique.
importedFrom: NCI Thesaurus
alternativeTerm: General Qualifiers General Modifier

qualifier
type: Class
subclass of: PropertyOrAttribute
definition: A term that helps define and render a concept unique.
alternativeTerm: Modifier
importedFrom: NCI thesaurus

Occupation
type: Class
importedFrom: SNOMED Clinical Terms
alternativeTerm: Occupations Job Occupation (occupation) Profession Job, NOS Occupation, NOS Profession, NOS
subclass of: SocialContext

native american
type: Class
subclass of: ethnic group
subclass of: suicido resource:arce6c6b11
alternativeTerm: American Indian
importedFrom: CRISP thesaurus, 2006
definition: a person having origins in any of the original peoples of the Americas, or who maintains cultural identification through tribal affiliation or community recognition.

percentage distribution by race
type: Class
subclass of: percentage distribution

asian
type: Class
subclass of: ethnic group
subclass of: suicido resource:arce6c6b12
alternativeTerm: Asians
definition: Denotes a person having origins in any of the original peoples of the Far East, Southeast Asia, or the Indian subcontinent, including Cambodia, China, India, Japan, Korea, Malaysia, Mongolia, Pakistan, the Philippine Islands, Thailand, and Vietnam.
importedFrom: NCI thesaurus

ISI-2
type: Class
definitionSource: (ISI, Bastein, Vallieres, & Morin, 2001)
definition: is a ISI index that measures the difficulty staying asleep.
subclass of: insomnia severity index

insomnia severity index
type: Class
subclass of: suicido resource:arce6c6b44
subclass of: symptom specific assessment tool
definitionSource: Bastien, Vallieres, & Morin, 2001
alternativeTerm: ISI
definition: ISI which has a 7-item index of insomnia severity using a 5-point scale that measures perceived severity of problems with sleep onset, sleep maintenance, and early morning awakenings; dissatisfaction with current sleep patterns; extent of interference with daily functioning; noticeable impairment in functioning; and extent of worry and anxiety associated with sleep patterns.

group
type: Class
subclass of: SocialContext
alternativeTerm: PCL-M
definition: Any number of entities (members) considered as a unit.
importedFrom: NCI thesaurus

SocialContext
type: Class
alternativeTerm: Social context (social concept) Social context, NOS
importedFrom: SNOMED Clinical Terms

HighSchoolStudent
type: Class
subclass of: Student
definition: is a person that participates in a course of study at a secondary learning institution.
exampleOfUsage: A freshman in high school.

exampleOfUsage

population group
type: Class
definition: A group of individuals united by a common factor (e.g., geographic location, ethnicity, disease, age, gender)
alternativeTerm: Group Population Subpopulation
subclass of: suicido resource:arce6c6b56
subclass of: suicido resource:arce6c6b57
subclass of: group
importedFrom: NCI thesaurus

wisconsin card sort test
type: Class
definitionSource: Grant and Berg, 1948; Heaton et al., 1993
alternativeTerm: WCST Wisconsin Card Sorting Test
subclass of: symptom specific assessment tool
definition: The Wisconsin Card Sorting Test (WCST) is a neuropsychological test of "set-shifting", i.e. the ability to display flexibility in the face of changing schedules of reinforcement.

insomnia
type: Class
importedFrom: NCI thesaurus
definition: A sleep disorder characterized by difficulty in falling asleep and/or remaining asleep.
subclass of: sleep disorder

clinical psychology assessment tool
type: Class
subclass of: diagnostic or prognostic test
importedFrom: NCI thesaurus
definition: Any one of several evaluation/assessment tools used to ascertain a patient's condition or diagnosis.

disease, disorder or finding
type: Class
importedFrom: NCI thesaurus
definition: A condition that is relevant to human neoplasms and non-neoplastic disorders. This includes observations, test results, history and other concepts relevant to the characterization of human pathologic conditions.

DSI-SS4
type: Class
subclass of: DepressionSymptomIndex-SuicidalitySubscale
subclass of: suicido resource:arce6c6b13
definition: Depression Symptom Index-Suicidality Subscale designed for the assessment of suicidal impulses.
definitionSource: (DSI-SS, Metalsky & Joiner, 1997)

DepressionSymptomIndex-SuicidalitySubscale
type: Class
subclass of: symptom specific assessment tool
alternativeTerm: DSI-SS
definitionSource: Metalsky & Joiner, 1997

SuicidalImpulses
type: Class
subclass of: SuicidalThoughts

Single
type: Class
subclass of: marital status
definition: The unmarried man or woman.
alternativeTerm: Maritally Unattached Person, Single Persons, Single Single Persons Never Married Unmarried

Gender identity disorder
type: Class
importedFrom: SNOMED clinical terms
alternativeTerm: Sexual orientation disturbance Gender identity disorder (disorder) Gender identity disorder, NOS Sexual orientation disturbance, NOS
subclass of: Identity disorder

Identity disorder
type: Class
subclass of: psychiatric disorder
importedFrom: SNOMED clinical terms
alternativeTerm: Identity problem Identity disorder (disorder)

BehavioralHealthMeasure
type: Class
alternativeTerm: BHM
subclass of: suicido resource:arce6c6b14
subclass of: symptom specific assessment tool
definition: Behavioral health measure is a 20-item self-report questionnaire that uses Likert rating scales to the three domains of mental health treatment: wellbeing, psychological symptoms, and life functioning. Each item has a 5-point scale ranging from 0 to 4, with higher scores indicating better health.
definitionSource: CelestHealthSolutions, 2008

psychological health
type: Class
definition: mental health status.
importedFrom: NCI thesaurus
subclass of: suicido resource:arce6c6b42
subclass of: health status

medical outcomes study short form general health survey
type: Class
subclass of: symptom specific assessment tool
alternativeTerm: Medical outcomes study short form general health survey (assessment scale)

air force member
type: Class
definition: person who is part of the air force
subclass of: person

PropertyOrAttribute
type: Class
definition: A distinguishing quality or prominent aspect of a person, object, action, process, or substance.
importedFrom: NCI Thesaurus

ISI-1
type: Class
definition: is a ISI index that measures the difficulty falling asleep.
definitionSource: (ISI, Bastein, Vallieres, & Morin, 2001)
subclass of: insomnia severity index

ISI-3
type: Class
subclass of: insomnia severity index
definitionSource: (ISI, Bastein, Vallieres, & Morin, 2001)
definition: is a ISI index that measures problems associated with early morning awakenings.

OddsRatio
type: Class
definition: The ratio of the odds of an event occurring in one group to the odds of it occurring in another group, or to a sample-based estimate of that ratio.
importedFrom: NCI Thesaurus
subclass of: RiskEstimate
alternativeTerm: relative odds

RiskEstimate
type: Class
importedFrom: NCI Thesaurus
alternativeTerm: absolute risk
subclass of: StatisticalTechnique
definition: The probability that an event will occur. It encompasses a variety of measures of the probability of a generally unfavorable outcome.MSH2001

StronglyAgree
type: Class
subclass of: ClinicalOrResearchAssessmentAnswer
importedFrom: NCI Thesaurus
definition: Intense concurrence.

ClinicalOrResearchAssessmentAnswer
type: Class
importedFrom: NCI Thesaurus
subclass of: qualifier

mood disorder
type: Class
definition: A category of psychiatric disorders which have as their most predominant feature a disturbance in mood.
subclass of: psychiatric disorder
subclass of: suicido resource:arce6c6b58
importedFrom: NCI thesaurus

inpatient
type: Class
subclass of: Medical Status
subclass of: patient
definition: A patient who is residing in the hospital where he is being treated.
importedFrom: NCI thesaurus
disjoint with: outpatient

Medical Status
type: Class
definitionSource: en.wikipedia.org/wiki/Medical_status
definition: Medical states or medical conditions are used to describe a patient's condition in a hospital. These terms are most commonly used by the news media and are rarely used by doctors, who in their daily business prefer to deal with medical problems in greater detail.
alternativeTerm: medical condition
subclass of: personal attribute

patient
type: Class
subclass of: suicido resource:arce6c6b26
subclass of: person
definition: A person who receives medical attention, care, or treatment, or who is registered with medical professional or institution with the purpose to receive medical care when necessary.
subclass of: suicido resource:arce6c6b27
subclass of: suicido resource:arce6c6b28
subclass of: suicido resource:arce6c6b29
importedFrom: NCI thesaurus
definitionSource: CDISC FDA
subclass of: suicido resource:arce6c6b30

outpatient
type: Class
importedFrom: NCI thesaurus
definition: A patient who comes to a healthcare facility for diagnosis or treatment but is not admitted for an overnight stay.
subclass of: Medical Status
subclass of: patient

PTSD checklist-military version
type: Class
subclass of: suicido resource:arce6c6b15
subclass of: symptom specific assessment tool
definitionSource: Weathers, Litz, Herman, Huska, & Keane, 1993
definition: The PCL-M is a 17-item self-report inventory that assesses the severity of each PTSD symptom according to the Diagnostic and Statistical Manual of Mental Disorders, Fourth Edition (DSM-IV) for three major criteria: reexperiencing symptoms, emotional numbing and avoidance, and hypervigilance.

post-traumatic stress disorder
type: Class
subclass of: suicido resource:arce6c6b43
subclass of: psychiatric disorder
definition: A class of traumatic stress disorders with symptoms that last more than one month. There are various forms of post-traumatic stress disorder, depending on the time of onset and the duration of these stress symptoms. In the acute form, the duration of the symptoms is between 1 to 3 months. In the chronic form, symptoms last more than 3 months. With delayed onset, symptoms develop more than 6 months after the traumatic event.
alternativeTerm: ACUTE POST TRAUMATIC STRESS DIS Acute Post Traumatic Stress Disorder Acute Post-Traumatic Stress Disorder CHRONIC POST TRAUMATIC STRESS DIS Chronic Post Traumatic Stress Disorder Chronic Post-Traumatic Stress Disorder DELAYED ONSET POST TRAUMATIC STRESS DIS Delayed Onset Post Traumatic Stress Disorder Delayed Onset Post-Traumatic Stress Disorder Neuroses, Post Traumatic Neuroses, Post-Traumatic Neuroses, Posttraumatic POST TRAUMATIC STRESS DIS POSTTRAUMATIC STRESS DIS POSTTRAUMATIC STRESS DISORDERS PTSD PTSD - Post-traumatic stress disorder Post Traumatic Stress Disorders Post-Traumatic Neuroses Post-Traumatic Neurosis Post-Traumatic Stress Disorders Post-traumatic stress syndrome Posttraumatic Neuroses Posttraumatic stress disorder Posttraumatic stress disorder (disorder) Posttraumatic stress disorder, NOS STRESS DIS POST TRAUMATIC STRESS DIS POSTTRAUMATIC Stress Disorder, Post Traumatic Stress Disorder, Post-Traumatic Stress Disorder, Posttraumatic Stress Disorders, Post Traumatic Stress Disorders, Post-Traumatic Stress Disorders, Posttraumatic disorder, post-traumatic stress post-traumatic stress disease traumatic neurosis
definitionSource: GeneRIF:12232785 MSH:D013313 NCIt:C3389 DOID:2055 SNOMEDCT:47505003 NIFSTD:birnlex_12679 ICD9:309.81
importedFrom: Experimental Factor Ontology

diseases or disorders
type: Class
definition: Any abnormal condition of the body or mind that causes discomfort, dysfunction, or distress to the person affected or those in contact with the person. The term is often used broadly to include injuries, disabilities, syndromes, symptoms, deviant behaviors, and atypical variations of structure and function.
alternativeTerm: Disorders Diseases and Disorders Diseases condition Disorder Disease
subclass of: suicido resource:arce6c6b33
subclass of: disease, disorder or finding
importedFrom: NCI thesaurus

impulsive behavior scale
type: Class
definitionSource: Whiteside & Lynam, 2001
definition: impulsive behavior scale was designed to measure impulsivity across dimensions of the Five Factor Model of personality.
subclass of: symptom specific assessment tool

RiskFactor
type: Class
importedFrom: NCI Thesaurus
definition: Any aspect of an individual's life, behavior, an environmental exposure, or an inborn or inherited characteristic that increases the likelihood of a disease, condition or injury.
subclass of: DiagnosticOrPrognosticFactor

DiagnosticOrPrognosticFactor
type: Class
definition: A characteristic of an organism that contributes to the diagnosis or treatment of a disease or to the prediction of clinical outcomes.
importedFrom: NCI Thesaurus

adequate finances
type: Class
subclass of: adequacy of income
alternativeTerm: Income sufficient to meet needs

adequacy of income
type: Class
subclass of: financial circumstances
alternativeTerm: Sufficiency of income for needs

Female homosexual
type: Class
alternativeTerm: Female homosexual state Lesbianism Lesbian Female homosexuality Female homosexual (finding)
importedFrom: SNOMED clinical terms
subclass of: Homosexual

schizophrenia and other psychotic disorders
type: Class
subclass of: suicido resource:arce6c6b20
subclass of: psychiatric disorder
importedFrom: NCI thesaurus
definition: A category of psychiatric disorders characterized by the presence of psychotic symptoms such as delusions or hallucinations or negative symptoms such as affective flattening.

DistressToleranceTest
type: Class
alternativeTerm: DTT
definition: The DTT is a behavioral index of distress tolerance during which participants complete an alternative form of the Wisconsin Card Sort Test.
subclass of: symptom specific assessment tool
definitionSource: Nock and Mendes, 2008

ConflictedGrief
type: Class
definition: Grief that is complicated by ambivalent feelings toward the friend or relative who has died.
subclass of: LossGriefAndBereavement
definitionSource: http://medical-dictionary.thefreedictionary.com/Conflicted+Grief

LossGriefAndBereavement
type: Class
subclass of: mental and behavioral signs and symptoms
importedFrom: NCI Thesaurus
definition: The normal response to a major loss, such as the death of a loved one. Grief may also be felt by a person with a serious, long-term illness or with a terminal illness. It may include feelings of great sadness, anger, guilt, and despair. Physical problems, such as not being able to sleep and changes in appetite, may also be part of grief.NCI-GLOSS
alternativeTerm: grief bereavement

Burdensomeness
type: Class
subclass of: suicido resource:arce6c6b16
subclass of: suicido resource:arce6c6b17
subclass of: suicido resource:arce6c6b18
subclass of: emotion
definitionSource: http://www.merriam-webster.com/dictionary/burdensomeness
definition: the quality or state of being burdensome.

correlatedWith
type: TransitiveProperty
type: ObjectProperty
domain: emotion
range: disease, disorder or finding

emotion
type: Class
subclass of: suicido resource:arce6c6b45
subclass of: Thing
definition: That aspect of consciousness devoted to affect or feeling; a strong feeling, aroused mental state, or intense state of drive or unrest directed toward a definite object, with physiological, somatic, and behavioral components.
alternativeTerm: Emotions Emotional
importedFrom: NCI thesaurus

Loneliness
type: Class
subclass of: mental and behavioral signs and symptoms
importedFrom: NCI Thesaurus
definition: The state of feeling sad or dejected as a result of lack of companionship or being separated from others.

MentalHealthOutcome
type: Class
subclass of: Outcome
definition: results of mental health

Outcome
type: Class
importedFrom: NCI Thesaurus
definition: The result of an action.
subclass of: OtherFinding
alternativeTerm: OUT Result

Transsexual
type: Class
importedFrom: Read Codes, Clinical Terms Version 3 (CTV3)
alternativeTerm: Sex change
subclass of: SexualOrientation

SexualOrientation
type: Class
subclass of: personal attribute
importedFrom: CRISP thesaurus, 2006
alternativeTerm: Sexual Preference Sex Orientation transsexualism asexual cross dresser cross dressing gender preference transsexual transgender
definition: direction of one's sexual interest toward members of the same, opposite, or both sexes; involves feelings, and sense of identity.

Technique
type: Class
importedFrom: NCI Thesaurus
subclass of: activity
alternativeTerm: Methods Method Technical Methods, Other Techniques Methods and Techniques
definition: A practiced and regimented skill or series of actions.

substance abuse
type: Class
subclass of: personal behavior
definition: Maladaptive pattern of drug or alcohol use that may lead to social, occupational, psychological, or physical problems.
importedFrom: NCI thesaurus
alternativeTerm: substance misuse

DSI-SS2
type: Class
definitionSource: (DSI-SS, Metalsky & Joiner, 1997)
definition: Depression Symptom Index-Suicidality Subscale designed for the assessment of suicidal plans.
subclass of: DepressionSymptomIndex-SuicidalitySubscale
subclass of: suicido resource:arce6c6b19

SuicidalPlans
type: Class
alternativeTerm: Planning suicide
subclass of: SuicidalThoughts

Sign
type: Class
importedFrom: NCI Thesaurus
subclass of: sign or symptom
definition: Objective evidence of disease perceptible to the examining healthcare provider.

office of the secretary of defense
type: Class
definition: The Office of the Secretary of Defense (OSD) is the Secretary and Deputy Secretary's (mainly) civilian staff.
alternativeTerm: OSD
subclass of: suicido resource:arce6c6b21
subclass of: department of defense
definitionSource: http://en.wikipedia.org/wiki/United_States_Department_of_Defense#Military_Departments

african american
type: Class
definition: A term used in the United States to categorize a population group comprised of persons having origins in any of the black racial groups of Africa. Includes population subgroups (e.g., Kenyan, Nigerian, Haitian). The concept refers also to individuals who classify themselves as described.
alternativeTerm: Afro American Black Populations BLACK OR AFRICAN AMERICAN Black
importedFrom: NCI thesaurus
subclass of: ethnic group
subclass of: suicido resource:arce6c6b22

professional organization
type: Class
definition: A formal group of people that exists to further a particular profession.
alternativeTerm: ORG Organizational Other Agency or Organization Organization Outside Bodies
definitionSource: BRIDG
subclass of: population group
importedFrom: NCI thesaurus

asian american
type: Class
importedFrom: NCI thesaurus
subclass of: ethnic group
subclass of: suicido resource:arce6c6b23
definition: Denotes a person having origins in any of the original peoples of the Far East, Southeast Asia, or the Indian subcontinent, and who was either born in the United States or who was naturalized as a citizen of the United States.
alternativeTerm: Asian Americans

personality disorder
type: Class
subclass of: psychiatric disorder
subclass of: suicido resource:arce6c6b24
importedFrom: NCI thesaurus
definition: A diverse category of psychiatric disorders characterized by behavior that deviates markedly from the expectations of the individual's culture; this pattern of deviation is pervasive and inflexible and is stable over time. The behavioral pattern negatively interferes with relationships and work.

SuicideAttempt
type: Class
subclass of: Attempt
importedFrom: NCI Thesaurus
definition: Self-inflicted harm in an attempt to end one's own life.

Disagree
type: Class
importedFrom: NCI Thesaurus
definition: To be at odds.
subclass of: ClinicalOrResearchAssessmentAnswer

SuicidalThoughts
type: Class
subclass of: suicido resource:arce6c6b25
subclass of: psychiatric disorder
definitionSource: NCI thesaurus
alternativeTerm: suicidal ideation
definition: Thoughts of taking one's own life.

Bisexual
type: Class
subclass of: SexualOrientation
importedFrom: CRISP thesaurus, 2006
definition: possessing both homosexual and heterosexual preferences; or true hermaphroditism, having gonads of both sexes.

age
type: Class
definition: How long something has existed; elapsed time since birth.
alternativeTerm: aged
subclass of: personal attribute
importedFrom: NCI thesaurus

personal attribute
type: Class
definition: The distinguishing qualities or prominent aspects of an individual person.
alternativeTerm: Subject Characteristics Personal
importedFrom: NCI thesaurus
subclass of: PropertyOrAttribute

AcquiredCapabilityForSuicideScale
type: Class
definitionSource: Van Orden et al., 2010
alternativeTerm: ACSS
subclass of: symptom specific assessment tool
definition: The ACSS assesses fearlessness about lethal self-injury as well as self-perceived ability to tolerate the pain involved in self-injury (e.g., “I can tolerate more pain than most people” and “The pain involved in dying frightens me” [reversed]).

gender
type: Class
definition: The assemblage of properties that distinguish people on the basis of the societal roles expected for the two sexes.
subclass of: personal attribute

hasGender
type: ObjectProperty
range: gender
domain: person

hasDiagnostic
type: ObjectProperty
range: disease, disorder or finding
domain: person

sample study population
type: Class
subclass of: suicido resource:arce6c6b34
subclass of: suicido resource:arce6c6b35
subclass of: suicido resource:arce6c6b36
definition: The population from which study subjects are recruited.
importedFrom: NCI thesaurus
subclass of: suicido resource:arce6c6b37
subclass of: suicido resource:arce6c6b38
subclass of: suicido resource:arce6c6b39
subclass of: population group

hasAge
type: ObjectProperty
range: age
domain: person

ClinicalPsychologyActivity
type: Class
definitionSource: NCI thesaurus
subclass of: activity
definition: Any specific activity undertaken during the course of a clinical psychology study

Soldier
type: Class
subclass of: army member
definition: A person who serves in an army.

army member
type: Class
definition: person who is part of the army
subclass of: person

hispanic or latino
type: Class
subclass of: ethnic group
subclass of: suicido resource:arce6c6b31
alternativeTerm: Hispanic Spanish Origin Hispanic Populations Latino Population Hispanics or Latinos
definition: A person of Mexican, Puerto Rican, Cuban, Central or South American or other Spanish culture or origin, regardless of race. An arbitrary ethnic classification.
importedFrom: NCI thesaurus

female
type: Class
alternativeTerm: F
definition: A person who belongs to the sex that normally produces ova. The term is used to indicate biological sex distinctions, or cultural gender role distinctions, or both.
importedFrom: NCI thesaurus
subclass of: gender
subclass of: suicido resource:arce6c6b32

percentage distribution by gender
type: Class
subclass of: percentage distribution

hasMaritalStatus
type: ObjectProperty
range: marital status
domain: person

department of the air force
type: Class
definition: The Department of the Air Force (DAF) is one of the three Military Departments within the Department of Defense of the United States of America.
alternativeTerm: DAF
subclass of: suicido resource:arce6c6b40
subclass of: department of defense
definitionSource: http://en.wikipedia.org/wiki/United_States_Department_of_the_Air_Force

percentage
type: Class
definitionSource: CDISC NCPDP
importedFrom: NCI thesaurus
subclass of: GeneralQualifier
definition: A fraction or ratio with 100 understood as the denominator.

Symptom
type: Class
importedFrom: NCI Thesaurus
subclass of: sign or symptom
definition: Subjective evidence of disease perceived by the patient.

Anorexia
type: Class
subclass of: EatingDisorder
definition: A disorder characterized by a loss of appetite.
importedFrom: NCI Thesaurus

EatingDisorder
type: Class
importedFrom: NCI Thesaurus
definition: A broad group of psychological disorders with abnormal eating behaviors leading to physiological effects from overeating or insufficient food intake.
subclass of: BehaviorDisorder

patient health questionnaire PHQ-9 set
type: Class
importedFrom: Logical Observation Identifier Names and Codes
subclass of: suicido resource:arce6c6b41
subclass of: symptom specific assessment tool
alternativeTerm: PANEL.SURVEY.PHQ9
definition: PHQ-9, which is a nine-item measure of depression severity corresponding to the nine criteria upon which is based on the diagnosis of DSM-IV depressive disorders. Items are scored from ‘0’ (not at all) to ‘3’ (nearly every day).

depression
type: Class
importedFrom: NCI thesaurus
definition: A melancholy feeling of sadness and despair.
subclass of: mood disorder

diagnostic or prognostic test
type: Class
subclass of: ClinicalPsychologyActivity
importedFrom: NCI thesaurus
definition: A test perfomed to identify a disease or make a prediction of the course of the disease.

health status
type: Class
definition: The state of a subject's mental or physical condition.
subclass of: personal attribute
importedFrom: NCI thesaurus

widowed
type: Class
alternativeTerm: Widowed Status
importedFrom: NCI thesaurus
definition: Indicates a person who is no longer married because of the death of his/her spouse and has not remarried.
subclass of: marital status

StatisticalTechnique
type: Class
definition: A method of analyzing or representing statistical data; a procedure for calculating a statistic.
alternativeTerm: Statistical Method
importedFrom: NCI Thesaurus
subclass of: Technique

CyclothymicDisorder
type: Class
importedFrom: MedDRA
subclass of: BipolarDisorder

BipolarDisorder
type: Class
definitionSource: NICHD
definition: A major affective disorder marked by severe mood swings (manic or major depressive episodes) and a tendency to remission and recurrence.
alternativeTerm: Manic-Depression Manic Depressive Disorder
subclass of: mood disorder
importedFrom: NCI Thesaurus

OtherFinding
type: Class
importedFrom: NCI Thesaurus
subclass of: finding

StronglyDisagree
type: Class
subclass of: ClinicalOrResearchAssessmentAnswer
importedFrom: NCI Thesaurus
definition: Intensely at odds.

financial circumstances
type: Class
subclass of: financial
importedFrom: Read Codes, Clinical Terms Version 3 (CTV3)
alternativeTerm: Economic circumstances

financial
type: Class
importedFrom: NCI thesaurus
definition: Concerning or related to monetary conditions.
subclass of: qualifier

substance use disorder
type: Class
subclass of: suicido resource:arce6c6b46
subclass of: psychiatric disorder

AuthorOfMeasureOrScale
type: Class
subclass of: author

hopelessness
type: Class
importedFrom: NCI thesaurus
subclass of: emotion
definition: The despair you feel when you have abandoned hope of comfort or success.
alternativeTerm: Feeling of Hopelessness Hopeless

global mental health scale
type: Class
definition: Global Mental Health (GMH) scale is calculated by taking the average score of all 20 items to provide an index of overall health.
alternativeTerm: GMH
subclass of: suicido resource:arce6c6b47
subclass of: symptom specific assessment tool
definitionSource: Bryan, 2011

united states department of veterans affairs
type: Class
subclass of: professional organization
alternativeTerm: VA
definition: VA is a government-run military veteran benefit system with Cabinet-level status. It is responsible for administering programs of veterans’ benefits for veterans, their families, and survivors. The benefits provided include disability compensation, pension, education, home loans, life insurance, vocational rehabilitation, survivors’ benefits, medical benefits and burial benefits. It is administered by the United States Secretary of Veterans Affairs.

BehaviorDisorder
type: Class
subclass of: psychiatric disorder
importedFrom: CRISP Thesaurus
definition: any of various conditions characterized by impairment of an individual's normal behavioral functioning, and caused by social, psychological, biochemical, genetic, or other factors, such as infection or head trauma.

DSI-SS1
type: Class
definition: Depression Symptom Index-Suicidality Subscale designed for the assessment of suicidal thoughts.
subclass of: DepressionSymptomIndex-SuicidalitySubscale
subclass of: suicido resource:arce6c6b48
definitionSource: (DSI-SS, Metalsky & Joiner, 1997)

percentage distribution by occupation
type: Class
subclass of: percentage distribution

male
type: Class
importedFrom: NCI thesaurus
definition: A person who belongs to the sex that normally produces sperm. The term is used to indicate biological sex distinctions, cultural gender role distinctions, or both.
alternativeTerm: Human, Male M
subclass of: suicido resource:arce6c6b49
subclass of: gender

beck scale for suicide ideation
type: Class
subclass of: symptom specific assessment tool
definition: The BSSI is a 21 item self report inventory designed for the assessment of suicide intention. A score of 0–2 is assigned for each item and total scores for the BSSI range from 0 to 42 where an increase in score represents a higher level of suicidal ideation and possible intent.
alternativeTerm: Beck scale for suicide ideation (assessment scale) BSSI
definitionSource: (BSSI; Beck & Steer, 1991)

Transsexualism
type: Class
subclass of: Gender identity disorder
importedFrom: SNOMED clinical terms
alternativeTerm: Transsexualism (disorder) Transsexualism, NOS

painful and provocative events scale
type: Class
definition: The PPE is a 26-item self-report measure that assesses the number of times participants have experienced a range of painful and/or provocative experiences throughout their lifetime (e.g., Have you participated in contact sports? Have you been a victim of physical abuse?).
alternativeTerm: PPE
definitionSource: Anestis & Joiner, 2012
subclass of: symptom specific assessment tool

interpersonal needs questionnaire
type: Class
definitionSource: Van Orden et al., 2008
definition: The INQ is a 25-item self-report questionnaire speciﬁcally designed to assess the two components of suicide desire proposed by the IPTS: thwarted belongingness and perceived burdensomeness.
subclass of: suicido resource:arce6c6b50
subclass of: suicido resource:arce6c6b51
subclass of: symptom specific assessment tool
alternativeTerm: INQ

Belongingness
type: Class
subclass of: suicido resource:arce6c6b52
subclass of: suicido resource:arce6c6b53
subclass of: suicido resource:arce6c6b54
subclass of: emotion
definition: Belongingness is the human emotional need to be an accepted member of a group.
definitionSource: http://en.wikipedia.org/wiki/Belongingness

personal behavior
type: Class
importedFrom: NCI thesaurus
subclass of: behavior
alternativeTerm: Personal Conduct
definition: The observable response of a person.

behavior
type: Class
importedFrom: NCI thesaurus
alternativeTerm: Behavioral Conduct
definition: The actions or reactions of an object or organism, usually in relation to the environment or surrounding world of stimuli.
subclass of: activity

married
type: Class
importedFrom: NCI thesaurus
subclass of: marital status
definition: Indicates a person currently joined in a legally binding matrimonial union. Classify common law marriage as married. Includes married couples living together and not living together.
alternativeTerm: Married Status

drug abuse
type: Class
alternativeTerm: Recreational Drug Use drug misuse
importedFrom: NCI thesaurus
definition: The use of a drug for a reason other than which it was intended or in a manner or in quantities other than directed.
subclass of: substance abuse

ActiveDutySoldier
type: Class
definitionSource: adapted from: http://en.wikipedia.org/wiki/Active_duty
definition: Active duty soldier refers to a full-time occupation as part of a military force.
alternativeTerm: active service soldier
subclass of: Occupation

ThwartedBelongingness
type: Class
definitionSource: http://www.ncbi.nlm.nih.gov/pmc/articles/PMC3377972/
definition: thwarted belongingness is a psychologically-painful mental state that results when the fundamental need for connectedness.
subclass of: Belongingness

marine member
type: Class
subclass of: person
definition: person who is part of the marine corps

Suicide
type: Class
definition: act or an instance of intentionally killing oneself.
importedFrom: CRISP Thesaurus
subclass of: SelfDestructiveBehavior

SelfDestructiveBehavior
type: Class
subclass of: BehaviorDisorder
definition: behavior in which one has a tendency to do harm to oneself, either as a direct or indirect result of their actions; frequently marked by impulse, but also includes chronic, injurious behaviors.
importedFrom: CRISP Thesaurus
alternativeTerm: self injurious behavior self mutilating behavior

Heterosexual
type: Class
definition: sexual attraction or relationship between members of the opposite sex.
importedFrom: CRISP thesaurus, 2006
subclass of: SexualOrientation

Worthlessness
type: Class
subclass of: emotion
importedFrom: NCI Thesaurus
alternativeTerm: Worthless Feeling of Worthlessness
definition: Feelings of being unimportant or useless.

white
type: Class
importedFrom: NCI thesaurus
subclass of: ethnic group
subclass of: suicido resource:arce6c6b55
definition: Denotes person with European, Middle Eastern, or North African ancestral origin who identifies, or is identified, as White.
alternativeTerm: Occidental Caucasoid Caucasians Whites Caucasian

Sadness
type: Class
alternativeTerm: Feeling of Sadness Sad
subclass of: emotion
importedFrom: NCI Thesaurus
definition: Feelings of grief or unhappiness.

BSSI-2
type: Class
definition: is a Beck scale for suicide ideation designed for the assessment the wish to die.
definitionSource: (BSSI; Beck & Steer, 1991)
subclass of: beck scale for suicide ideation

lives alone
type: Class
importedFrom: Read Codes, Clinical Terms Version 3 (CTV3)
subclass of: household composition

ObsessiveCompulsiveDisorder
type: Class
alternativeTerm: OCD Obsessive-Compulsive Disorder
definition: Recurrent obsessions or compulsions that are severe enough to be time consuming (i.e., they take more than 1 hour a day) or cause marked distress or significant impairment (DSM-IV).
subclass of: anxiety disorder
importedFrom: NCI Thesaurus

ElementarySchoolStudent
type: Class
definition: Elementary school students are students from kindergarten through either grade 5 or grade 6, depending on the region and time in history.
subclass of: Student
definitionSource: adapted from: http://en.wikipedia.org/wiki/Primary_education_in_the_United_States

BSSI-1
type: Class
definitionSource: (BSSI; Beck & Steer, 1991)
subclass of: beck scale for suicide ideation
definition: is a Beck scale for suicide ideation designed for the assessment the wish to live.

percentage distribution by disease, disorder or finding
type: Class
subclass of: percentage distribution

posttraumatic stress disorder
type: Class
definitionSource: Marshall-Berenz et al., 2010
subclass of: symptom specific assessment tool
alternativeTerm: PTSD
definition: Posttraumatic stress disorder (PTSD) is a severe anxiety disorder that can develop after exposure to any event that results in psychological trauma.

beck depression inventory
type: Class
importedFrom: NCI thesaurus
alternativeTerm: BDI
subclass of: symptom specific assessment tool
definition: A twenty-one question survey completed by a patient, with each answer scored on a scale of 0 to 3, designed to measure presence of depression.

Stress
type: Class
importedFrom: NCI Thesaurus
subclass of: Symptom
definition: the biological response to noxious, demanding, or unpleasant stimuli or conditions; do not confuse stress with STRESSOR, which is the stimulus.CSP2003 A pathological process resulting from the reaction of the body to external forces and abnormal conditions that tend to disturb the organism's homeostasis.MSH2003_2003_05_12 The response of the body to physical, mental, or emotional pressure. This may make a person feel frustrated, angry, or anxious, and may cause unhealthy chemical changes in the body. Untreated, long-term stress may lead to many types of mental and physical health problems.NCI-GLOSS

Agree
type: Class
importedFrom: NCI Thesaurus
subclass of: ClinicalOrResearchAssessmentAnswer
definition: To concur.

separated
type: Class
subclass of: marital status
importedFrom: NCI thesaurus
definition: Indicates a person living apart from his/her spouse by legal arrangement.
alternativeTerm: Separated Status LEGALLY SEPARATED

inadequate finances
type: Class
subclass of: adequacy of income
alternativeTerm: Income insufficient to meet needs

positive and negative social exchanges scale
type: Class
definitionSource: Mavandadi, Rook, Newsom and Oslin, 2012
definition: measures the perceived frequency of positive and negative social exchanges.
subclass of: symptom specific assessment tool

DisenfranchisedGrief
type: Class
definition: Disenfranchised grief is a term describing grief that is not acknowledged by society.
exampleOfUsage: Examples of events leading to disenfranchised grief are the loss of a pet, an aborted/miscarried pregnancy, a mother's loss or surrender of a child to adoption, the death of a celebrity, etc.
subclass of: LossGriefAndBereavement
definitionSource: http://en.wikipedia.org/wiki/Disenfranchised_grief

Bulimia
type: Class
subclass of: EatingDisorder
definition: A disorder characterized by recurrent episodes of binge-eating over which the individual feels a lack of control; these episodes of binge-eating are followed by recurrent compensatory behavior to prevent weight gain, usually self-induced vomiting. In addition, self-evaluation is unduly influenced by body image.
importedFrom: NCI Thesaurus

Distress
type: Class
definition: Extreme physical pain or psychological suffering.
subclass of: Sign
importedFrom: NCI Thesaurus

hasRace
type: ObjectProperty
range: ethnic group
domain: person

DOI_10.1002/jclp.20726
type: NamedIndividual
hasPercentageDistribution: 91.8_percent
type: male

91.8_percent
type: NamedIndividual
type: percentage distribution by gender

32_percent
type: NamedIndividual
type: percentage distribution by occupation

expandExpressionTo

2.3_percent
type: NamedIndividual
type: percentage distribution by occupation

DOI_10.1007/s00127-012-0534-5
type: NamedIndividual
type: male
hasPercentageDistribution: 90.9_percent

90.9_percent
type: NamedIndividual
type: percentage distribution by gender

isDenotatorType

DOI_10.1002/jclp.20726
type: NamedIndividual
hasPercentageDistribution: 8.2_percent
type: hispanic or latino

8.2_percent
type: NamedIndividual
type: percentage distribution by race

hasObsolescenceReason

DOI_10.1002/jclp.20726
type: NamedIndividual
type: african american
hasPercentageDistribution: 14.2_percent

14.2_percent
type: NamedIndividual
type: percentage distribution by race

definitionEditor

OBOFoundryUniqueLabel

inBranch

firstOrderLogicExpression

20.3_percent
type: NamedIndividual
type: percentage distribution by disease, disorder or finding

HP_0000722
definition: A disorder characterized by the presence of persistent and recurrent irrational thoughts (obsessions), resulting in marked anxiety and repetitive excessive behaviors (compulsions) as a way to try to decrease that anxiety.

editorNote

DOI_10.1007/s00127-012-0534-5
type: NamedIndividual
hasPercentageDistribution: 48.5_percent
type: white

48.5_percent
type: NamedIndividual
type: percentage distribution by race

3.7_percent
type: NamedIndividual
type: percentage distribution by occupation

antisymmetricProperty

curatorNote

61.6_percent
type: NamedIndividual
type: percentage distribution by occupation

0.5_percent
type: NamedIndividual
type: percentage distribution by occupation

termReplacedBy

editorPreferedTerm

hasCurationStatus

expandAssertionTo

DOI_10.1007/s00127-012-0534-5
type: NamedIndividual
type: female
hasPercentageDistribution: 9.09_percent

9.09_percent
type: NamedIndividual
type: percentage distribution by gender

DOI_10.1002/jclp.20726
type: NamedIndividual
type: asian
hasPercentageDistribution: 2.7_percent

2.7_percent
type: NamedIndividual
type: percentage distribution by race

DOI_10.1002/jclp.20726
type: NamedIndividual
hasPercentageDistribution: 8.2_percent
type: female

8.2_percent
type: NamedIndividual
type: percentage distribution by gender

DOI_10.1002/jclp.20726
type: NamedIndividual
hasPercentageDistribution: 72.1_percent
type: white

72.1_percent
type: NamedIndividual
type: percentage distribution by race

philadelphia va medical center
type: NamedIndividual
alternativeTerm: PVAMC
type: locality
location of: DOI_10.1007/s00127-012-0534-5

DOI_10.1007/s00127-012-0534-5
type: NamedIndividual
hasAge: 55 years
located in: philadelphia va medical center
type: sample study population

55 years
type: NamedIndividual
type: age

DOI_10.1002/jclp.20726
type: NamedIndividual
type: sample study population
hasAge: 28 years
located in: military base in Iraq

28 years
type: NamedIndividual
type: age