Demographics
type: Class
URL: https://www.phenxtoolkit.org/index.php

Anthropometrics
type: Class
URL: https://www.phenxtoolkit.org/index.php

Alcohol, Tobacco and Other Substances
type: Class
URL: https://www.phenxtoolkit.org/index.php

Cardiovascular
type: Class
URL: https://www.phenxtoolkit.org/index.php

Nutrition and Dietary Supplements
type: Class
URL: https://www.phenxtoolkit.org/index.php

Environmental Exposures
type: Class
URL: https://www.phenxtoolkit.org/index.php

Cancer
type: Class
URL: https://www.phenxtoolkit.org/index.php

Oral Health
type: Class
URL: https://www.phenxtoolkit.org/index.php

Respiratory
type: Class
URL: https://www.phenxtoolkit.org/index.php

Reproductive Health
type: Class
URL: https://www.phenxtoolkit.org/index.php

Ocular
type: Class
URL: https://www.phenxtoolkit.org/index.php

Psychiatric
type: Class
URL: https://www.phenxtoolkit.org/index.php

Neurology
type: Class
URL: https://www.phenxtoolkit.org/index.php

Diabetes
type: Class
URL: https://www.phenxtoolkit.org/index.php

Physical Activity and Physical Fitness
type: Class
URL: https://www.phenxtoolkit.org/index.php

Infectious Diseases and Immunity
type: Class
URL: https://www.phenxtoolkit.org/index.php

Skin, Bone, Muscle and Joint
type: Class
URL: https://www.phenxtoolkit.org/index.php

Psychosocial
type: Class
URL: https://www.phenxtoolkit.org/index.php

Gastrointestinal
type: Class
URL: https://www.phenxtoolkit.org/index.php

Speech and Hearing
type: Class
URL: https://www.phenxtoolkit.org/index.php

Social Environments
type: Class
URL: https://www.phenxtoolkit.org/index.php

Substance Abuse and Addiction
type: Class
URL: https://www.phenxtoolkit.org/index.php

Assessment of Substance Use and Substance Use Disorders
type: Class
URL: https://www.phenxtoolkit.org/index.php

Substance-specific Intermediate Phenotypes
type: Class
URL: https://www.phenxtoolkit.org/index.php

Substance Use-related Neurobehavioral and Cognitive Risk Factors
type: Class
URL: https://www.phenxtoolkit.org/index.php

Substance Use-related Psychosocial Risk Factors
type: Class
URL: https://www.phenxtoolkit.org/index.php

Substance Use-related Community Factors
type: Class
URL: https://www.phenxtoolkit.org/index.php

Substance Use-related Co-morbidities and Health-related Outcomes
type: Class
URL: https://www.phenxtoolkit.org/index.php

Substance Abuse and Addiction Core: Tier 1
type: Class
URL: https://www.phenxtoolkit.org/index.php

Substance Abuse and Addiction Core: Tier 2
type: Class
URL: https://www.phenxtoolkit.org/index.php

Alcohol - Age of First Use
type: Class
subclass of: Alcohol, Tobacco and Other Substances
definition: Question asking the respondent how old s/he was when he or she first consumed alcohol.
URL: https://www.phenxtoolkit.org/index.php
cui: C0552479
CADSR CDE: 2008447
LOINC: 62545-9

Alcohol - Lifetime Abuse and Dependence
type: Class
subclass of: Alcohol, Tobacco and Other Substances
definition: Questions query respondent about whether s/he has ever had symptoms of alcohol abuse and/or dependence.
URL: https://www.phenxtoolkit.org/index.php
cui: C0221628
CADSR CDE: 2820811
LOINC: 62551-7

Tobacco - Smoking Status
type: Class
subclass of: Alcohol, Tobacco and Other Substances
definition: Questions asking the respondent about smoking status in his or her entire life.
URL: https://www.phenxtoolkit.org/index.php
cui: C1519386
CADSR CDE: 2923486, 2436233
LOINC: 62553-3, 62554-1

Tobacco - 30-Day Quantity and Frequency
type: Class
subclass of: Alcohol, Tobacco and Other Substances
definition: Questions asking the respondent about quantity and frequency of cigarette smoking during the past 30 days.
URL: https://www.phenxtoolkit.org/index.php
cui: C1519384
CADSR CDE: 2923449, 2923471, 2194945, 2820866
LOINC: 62497-3, 62498-1

Tobacco - Age of Initiation of Use
type: Class
subclass of: Alcohol, Tobacco and Other Substances
definition: Questions asking the respondent how old s/he was when s/he first smoked cigarettes and first smoked cigarettes regularly.
URL: https://www.phenxtoolkit.org/index.php
cui: C1519384
CADSR CDE: 2923476, 2820880
LOINC: 62556-6, 62495-7

Tobacco - Age of Offset of Use
type: Class
subclass of: Alcohol, Tobacco and Other Substances
definition: Questions asking a former smoker respondent how long it has been since s/he has quit smoking.
URL: https://www.phenxtoolkit.org/index.php
cui: C1519384
CADSR CDE: 2923481, 2786151
LOINC: 62500-4, 62501-2

Tobacco - Nicotine Dependence
type: Class
subclass of: Alcohol, Tobacco and Other Substances
definition: Questions query respondent on whether s/he has symptoms of nicotine dependence.
URL: https://www.phenxtoolkit.org/index.php
cui: C0451156
CADSR CDE: 2820895
LOINC: 62503-8

Substances - Lifetime Use
type: Class
subclass of: Alcohol, Tobacco and Other Substances
definition: Question asking the respondent if s/he has ever used a drug during his or her entire life.
URL: https://www.phenxtoolkit.org/index.php
cui: C1299544
CADSR CDE: 2821039
LOINC: 62505-3

Substances - 30-Day Frequency
type: Class
subclass of: Alcohol, Tobacco and Other Substances
definition: Questions asking the respondent how many days in the past 30 days s/he used a drug.
URL: https://www.phenxtoolkit.org/index.php
cui: C1299544
CADSR CDE: 2828651
LOINC: 62509-5

Current Age
type: Class
subclass of: Demographics
definition: Question to determine the respondent's current age using his/her date of birth.
URL: https://www.phenxtoolkit.org/index.php
cui: C0001779
CADSR CDE: 2201154
LOINC: 62293-6

Birthplace
type: Class
subclass of: Demographics
definition: Question asking the respondent in what country he/she was born.
URL: https://www.phenxtoolkit.org/index.php
cui: C0032040
CADSR CDE: 2682009
LOINC: 63046-7

Birthplace of Parents
type: Class
subclass of: Demographics
definition: Question asking the respondent for his/her biological mother's place of birth.|Question asking the respondent for his/her biological father's place of birth.
URL: https://www.phenxtoolkit.org/index.php
cui: C0032040
CADSR CDE: 2789931, 2789933
LOINC: 63048-3

Birthplace of Grandparents
type: Class
subclass of: Demographics
definition: Question asking the respondent for his/her maternal grandmother's place of birth. Question asking the respondent for his/her maternal grandfather's place of birth. Question asking the respondent for his/her paternal grandmother's place of birth. Question asking the respondent for his/her paternal grandfather's place of birth.
URL: https://www.phenxtoolkit.org/index.php
cui: C0032040
CADSR CDE: 2789935, 2789937, 2789939, 2789941
LOINC: 63050-9

Ethnicity
type: Class
subclass of: Demographics
definition: Question asking the respondent to identify whether he/she is of Hispanic or Latino origin. The United States Office of Management and Budget (OMB) standards for the classification of Federal data on race and ethnicity state that "race and ethnicity may be thought of in terms of social and cultural characteristics as well as ancestry."
URL: https://www.phenxtoolkit.org/index.php
cui: C0015031
CADSR CDE: 2200284
LOINC: 62299-3

Race
type: Class
subclass of: Demographics
definition: Question asking the respondent his/her race.|United States Office of Management and Budget (OMB) standards for the classification of Federal data on race and ethnicity state that "race and ethnicity may be thought of in terms of social and cultural characteristics as well as ancestry."
URL: https://www.phenxtoolkit.org/index.php
cui: C0034510
CADSR CDE: 2200286
LOINC: 56091-2

Gender
type: Class
subclass of: Demographics
definition: Question asking the respondent for his/her self-conception of being male or female.
URL: https://www.phenxtoolkit.org/index.php
cui: C0079399
CADSR CDE: 2179640
LOINC: 46098-0

Current Address
type: Class
subclass of: Demographics
definition: Question asking the respondent for his/her current address.
URL: https://www.phenxtoolkit.org/index.php
cui: C1442065
CADSR CDE: 2199956
LOINC: 63052-5

Current Marital Status
type: Class
subclass of: Demographics
definition: Question asking the respondent for his/her current marital status.
URL: https://www.phenxtoolkit.org/index.php
cui: C0024819
CADSR CDE: 2188083
LOINC: 63054-1

Current Educational Attainment
type: Class
subclass of: Demographics
definition: Question asking the respondent for his/her highest educational attainment at the current time.
URL: https://www.phenxtoolkit.org/index.php
cui: C0682174
CADSR CDE: 2674076
LOINC: 63056-6

Annual Family Income
type: Class
subclass of: Demographics
definition: Question asking the respondent for his/ her family's total family income from the last calendar year.
URL: https://www.phenxtoolkit.org/index.php
cui: C0557163
CADSR CDE: 2738624
LOINC: 63058-2

Years Living in the U.S.
type: Class
subclass of: Demographics
definition: The duration (in years) of stay in the United States, asked only of immigrants.
URL: https://www.phenxtoolkit.org/index.php
cui: C1442065
CADSR CDE: 2793232
LOINC: 63060-8

Current Employment Status
type: Class
subclass of: Demographics
definition: Question asking the respondent for his/her current employment status.
URL: https://www.phenxtoolkit.org/index.php
cui: C0014003
CADSR CDE: 2003074
LOINC: 63062-4

Household Roster-Relationships
type: Class
subclass of: Demographics
definition: Question asking the respondent about his/her relationship with others in his/her household.
URL: https://www.phenxtoolkit.org/index.php
cui: C0557084
CADSR CDE: 2793170
LOINC: 63064-0

Health Insurance Coverage
type: Class
subclass of: Demographics
definition: Question asking whether the respondent is covered by health insurance or some other form of health care coverage at the time of the interview.
URL: https://www.phenxtoolkit.org/index.php
cui: C0376629
CADSR CDE: 2518985
LOINC: 63066-5

Arm Span
type: Class
subclass of: Anthropometrics
definition: Measurement of the maximum distance between the extended middle fingers of the right and left hands. Generally, in children the arm span measurement is 1 cm shorter than height; in adolescents the arm span is the same length as height; and in adults the arm span measurement exceeds height by approximately 5 cm.
URL: https://www.phenxtoolkit.org/index.php
cui: C0203910
CADSR CDE: 2794253
LOINC: 62404-9

Birth Weight
type: Class
subclass of: Anthropometrics
definition: Birth weight (measured, recalled, or vital records/chart abstraction) is the weight of the infant in kilograms or pounds at birth. Birth weight is directly related to gestational age.
URL: https://www.phenxtoolkit.org/index.php
cui: C0005612
CADSR CDE: 2793347, 2793342, 2793352
LOINC: 62405-6, 8339-4, 56056-5

Body Image
type: Class
subclass of: Anthropometrics
definition: Self-reported body size using a visual scale at selected ages and/or currently; or parents' perception of their child's body size.
URL: https://www.phenxtoolkit.org/index.php
cui: C0005891
CADSR CDE: 2794263
LOINC: 63522-7

Child Head Circumference
type: Class
subclass of: Anthropometrics
definition: Child head circumference is the maximum circumference measurement around the head from frontal bones to the occipital prominence of the back of the head.
URL: https://www.phenxtoolkit.org/index.php
cui: C0262499
CADSR CDE: 2793421
LOINC: 62406-4

Hand Dominance
type: Class
subclass of: Anthropometrics
definition: Dominance is measured to assess the movement, mobility, and flexibility of an individual to determine which side of the body the study subject favors or the strength of hand activity.
URL: https://www.phenxtoolkit.org/index.php
cui: C1286612
CADSR CDE: 2793506, 2180147
LOINC: 56096-1, 56101-9

Height
type: Class
subclass of: Anthropometrics
definition: Height is the distance from the top of the participant's head to the heels of his/her feet (i.e., the vertical length).
URL: https://www.phenxtoolkit.org/index.php
cui: C0005890
CADSR CDE: 2794243, 2794238, 2179643, 2793242
LOINC: 62335-5, 62295-1, 62294-4, 62296-9

Hip Circumference
type: Class
subclass of: Anthropometrics
definition: Hip Circumference is the measurement of the maximum circumference of the hips.
URL: https://www.phenxtoolkit.org/index.php
cui: C0562350
CADSR CDE: 2793486
LOINC: 62409-8

Maximum Adult Height
type: Class
subclass of: Anthropometrics
definition: Height is the distance from the top of the participant's head to the heels of his or her feet (i.e., the vertical length). This self-reported measure asks about current height at 25 years of age.
URL: https://www.phenxtoolkit.org/index.php
cui: C0005890
CADSR CDE: 2793264
LOINC: 62410-6

Maximum Adult Weight
type: Class
subclass of: Anthropometrics
definition: Self-reported or surrogate-reported maximum adult weight of participant.
URL: https://www.phenxtoolkit.org/index.php
cui: C0455115
CADSR CDE: 2793282
LOINC: 62411-4

Mid-Upper Arm Circumference
type: Class
subclass of: Anthropometrics
definition: Measurement of the circumference of the mid-upper arm
URL: https://www.phenxtoolkit.org/index.php
cui: C0562351
CADSR CDE: 2794248
LOINC: 62412-2

Neck Circumference
type: Class
subclass of: Anthropometrics
definition: Measurement of the circumference of the neck.
URL: https://www.phenxtoolkit.org/index.php
cui: C1630403
CADSR CDE: 2793491
LOINC: 62413-0

Pregnancy Weight Gain
type: Class
PARENT UMLS CUI: C0043094
subclass of: Anthropometrics
definition: Change in weight of the participant during the course of pregnancy for the most recent pregnancy.
URL: https://www.phenxtoolkit.org/index.php
cui: C1398625
CADSR CDE: 2793337
LOINC: 62414-8

Weight Loss/Gain
type: Class
subclass of: Anthropometrics
definition: Change in weight over the past year.
URL: https://www.phenxtoolkit.org/index.php
cui: C0005911
CADSR CDE: 2793304
LOINC: 62415-5

Weight
type: Class
PARENT UMLS CUI: C0455115
subclass of: Anthropometrics
definition: Current Weight - Measured Current measured weight is the weight in kilograms or pounds of the participant. |Current Weight - Self-Reported* Self-reported weight is the weight in kilograms or pounds as reported by the participant. *NOTE: Self-reported weight values are considered to be less accurate and are only used when measured weight cannot be obtained.
URL: https://www.phenxtoolkit.org/index.php
cui: C0005910
CADSR CDE: 2179689, 2793247
LOINC: 62297-7, 62298-5

Waist Circumference
type: Class
subclass of: Anthropometrics
definition: Waist circumference is a measurement to estimate the abdominal circumference.
URL: https://www.phenxtoolkit.org/index.php
cui: C0455829
CADSR CDE: 2793481, 2793481
LOINC: 56087-0, 56086-2

Body Composition
type: Class
subclass of: Anthropometrics
definition: Dual-energy X-ray absorptiometry (DXA) is one of the most widely used methods to assess body composition. A densitometer scanner device is used to scan the entire body or specific body sites such as the hip, spine, and limbs. DXA uses X-ray energy to measure body fat, muscle, and bone mineral and as a result, a small amount of radiation is delivered to the body during the DXA scan procedure. The results from a whole body DXA scan can be used to estimate total mass (gm), bone mineral content (BMC) (gm), bone area (cm2), bone mineral density, fat mass, lean mass excluding BMC (gm), lean mass including BMC (gm), and percent body fat (%). DXA scanner manufacturers produce special software that is used to analyze the DXA scan data to produce body composition results. |
URL: https://www.phenxtoolkit.org/index.php
cui: C0005885
CADSR CDE: 2936520
LOINC: 63520-1

Alcohol - Lifetime Use
type: Class
subclass of: Alcohol, Tobacco and Other Substances
definition: Question asking the respondent if s/he has ever consumed any alcoholic beverage during his or her entire life.
URL: https://www.phenxtoolkit.org/index.php
cui: C0552479
CADSR CDE: 5227
LOINC: 62543-4

Alcohol - 30-Day Quantity and Frequency
type: Class
subclass of: Alcohol, Tobacco and Other Substances
definition: Questions asking the respondent about quantity and frequency of alcohol consumption during the past 30 days.
URL: https://www.phenxtoolkit.org/index.php
cui: C0552479
CADSR CDE: 2820776, 2820779
LOINC: 62547-5

Alcohol - Maximum Drinks in 24 Hours
type: Class
subclass of: Alcohol, Tobacco and Other Substances
definition: Question asks respondent about his or her maximum consumption of alcoholic beverages in a 24-hour period.
URL: https://www.phenxtoolkit.org/index.php
cui: C0552479
CADSR CDE: 2820804
LOINC: 62549-1

Occupation/Occupational History
type: Class
subclass of: Environmental Exposures
definition: Questions about the respondent's current occupation and longest held job. If appropriate, a complete work history is obtained.
URL: https://www.phenxtoolkit.org/index.php
cui: C0552483
CADSR CDE: 2954159
LOINC: 62522-8

Plastic Exposures at Work and Home
type: Class
subclass of: Environmental Exposures
definition: Questions about recent renovations and the type of flooring and walls in the person's work environment and residence.
URL: https://www.phenxtoolkit.org/index.php
cui: C2220491
CADSR CDE: 3005240
LOINC: 62540-0

Cumulative Lifetime Alcohol Exposure
type: Class
subclass of: Cancer
definition: Measure to determine total lifetime alcohol use
URL: https://www.phenxtoolkit.org/index.php
cui: C0001948
CADSR CDE: 2960970
LOINC: 62559-0

Cumulative Lifetime Physical Activity
type: Class
subclass of: Cancer
definition: Measure to assess lifetime strenuous and moderate physical activity
URL: https://www.phenxtoolkit.org/index.php
cui: C0026606
CADSR CDE: 2960975
LOINC: 62561-6

Passive Smoke Exposure
type: Class
subclass of: Cancer
definition: Measure to determine exposure to environmental tobacco smoke (ETS)
URL: https://www.phenxtoolkit.org/index.php
cui: C0037370
CADSR CDE: 2954172
LOINC: 62563-2

Exogenous Female Hormone Use
type: Class
subclass of: Cancer
definition: Measure to assess use of the hormones estrogen and progesterone
URL: https://www.phenxtoolkit.org/index.php
cui: C1516999
CADSR CDE: 2961276
LOINC: 62565-7

Ovulation History
type: Class
subclass of: Cancer
definition: Measure to assess ovulation history, including pregnancy and breast-feeding history
URL: https://www.phenxtoolkit.org/index.php
cui: C0029965
CADSR CDE: 2961271
LOINC: 62567-3

Cancer: Personal and Family History
type: Class
subclass of: Cancer
definition: Measure to assess if respondent and his or her biological parents, siblings, and children have had cancer
URL: https://www.phenxtoolkit.org/index.php
cui: C0260515
CADSR CDE: 2961265
LOINC: 62569-9

Personal Perception and Knowledge of Smoking-related Cancer Risk
type: Class
subclass of: Cancer
definition: Measure to assess concerns and perceived risk of being diagnosed with lung cancer
URL: https://www.phenxtoolkit.org/index.php
cui: C0037369
CADSR CDE: 2961260
LOINC: 62571-5

Cancer Screenings
type: Class
subclass of: Cancer
definition: Measure to assess an individual's cancer screenings during the past 3 years
URL: https://www.phenxtoolkit.org/index.php
cui: C0199230
CADSR CDE: 2961250
LOINC: 62575-6

Smoking Quit Attempts
type: Class
subclass of: Cancer
definition: Measure to determine intention to quit smoking and obtain details of past attempts to quit
URL: https://www.phenxtoolkit.org/index.php
cui: C0085134
CADSR CDE: 2960991
LOINC: 62608-5

Cancer Treatments
type: Class
subclass of: Cancer
definition: A measure to assess history of cancer treatments
URL: https://www.phenxtoolkit.org/index.php
cui: C0920425
CADSR CDE: 2960986
LOINC: 62610-1

Medications (Current and Past Use of Pain Relievers, Statins, and Steroids)
type: Class
subclass of: Cancer
definition: Measure to assess current and past use of prescription and over-the-counter (OTC) pain-relieving medications, statins, steroids, anti-inflammatory medications, and inhaled bronchodilators
URL: https://www.phenxtoolkit.org/index.php
cui: C0240320
CADSR CDE: 2960980
LOINC: 62732-3

Pre-existing Conditions Associated with Cancer
type: Class
subclass of: Cancer
definition: Measure to assess history of clinician-diagnosed illnesses
URL: https://www.phenxtoolkit.org/index.php
cui: C0596244
CADSR CDE: 2961255
LOINC: 62573-1

Breast or Bottle Feeding Patterns
type: Class
subclass of: Oral Health
definition: A measure to assess the types of feedings and feeding schedules of an infant currently between 6 and 12 months of age.
URL: https://www.phenxtoolkit.org/index.php
cui: C0006147
CADSR CDE: 2966276
LOINC: 62578-0

Existence of Cleft Lip or Palate
type: Class
subclass of: Oral Health
definition: A measure to assess if an individual has a diagnosed cleft lip or palate, its location and if other relatives have the same condition.
URL: https://www.phenxtoolkit.org/index.php
cui: C0008925
CADSR CDE: 2966284
LOINC: 62586-3

Consumption of Sweet Beverages
type: Class
subclass of: Oral Health
definition: A measure to assess concentrated intake of sweet beverages in children between 3 and 5 years of age.
URL: https://www.phenxtoolkit.org/index.php
cui: C0556234
CADSR CDE: 2966427
LOINC: 62580-6

Dental Caries Experience - Prevalence
type: Class
subclass of: Oral Health
definition: A measure to assess the Decayed, Missing or Filled Tooth Surfaces.
URL: https://www.phenxtoolkit.org/index.php
cui: C0011334
CADSR CDE: 2966451
LOINC: 62582-2

Dry Mouth
type: Class
subclass of: Oral Health
definition: A measure to assess whether the respondent has a dry mouth and evidence of decreased salivary flow.
URL: https://www.phenxtoolkit.org/index.php
cui: C0043352
CADSR CDE: 2966457
LOINC: 62584-8

Presence of Dental Fluorosis
type: Class
subclass of: Oral Health
definition: A measure to assess the prevalence and severity of dental fluorosis.
URL: https://www.phenxtoolkit.org/index.php
cui: C0026618
CADSR CDE: 2966462
LOINC: 62600-2

Fluoride Use
type: Class
subclass of: Oral Health
definition: A measure to assess fluoride exposure from fluoride toothpaste and dietary fluoride supplements.
URL: https://www.phenxtoolkit.org/index.php
cui: C0450164
CADSR CDE: 2966467
LOINC: 62588-9

Tobacco (non-cigarette) - Product Use
type: Class
subclass of: Oral Health
definition: A measure to assess participant use of tobacco products other than cigarettes in his or her lifetime.
URL: https://www.phenxtoolkit.org/index.php
cui: C0543414
CADSR CDE: 2966472
LOINC: 62604-4

Malocclusion
type: Class
subclass of: Oral Health
definition: A measure to categorize the misalignment of teeth and/or incorrect relation between the teeth of the two dental arches.
URL: https://www.phenxtoolkit.org/index.php
cui: C0024636
CADSR CDE: 2966477
LOINC: 62590-5

Oral Mucosal Lesions
type: Class
subclass of: Oral Health
definition: A measure to assess the existence or past existence of oral mucosal lesions.
URL: https://www.phenxtoolkit.org/index.php
cui: C0149744
CADSR CDE: 2966482
LOINC: 62596-2

Number of Natural Teeth
type: Class
subclass of: Oral Health
definition: A measure to assess the number of natural teeth in an adult or in a child.
URL: https://www.phenxtoolkit.org/index.php
cui: C0449772
CADSR CDE: 2966487
LOINC: 62592-1

Oral Hygiene - Personal Care
type: Class
subclass of: Oral Health
definition: A measure to assess the frequency of brushing and flossing one's teeth.
URL: https://www.phenxtoolkit.org/index.php
cui: C0029164
CADSR CDE: 2966492
LOINC: 62594-7

Toothache and Orofacial Pain
type: Class
subclass of: Oral Health
definition: A measure to assess toothache and chronic orofacial pain in the past 6 months.
URL: https://www.phenxtoolkit.org/index.php
cui: C0178782
CADSR CDE: 2966637
LOINC: 62606-9

Periodontal Disease - Prevalence
type: Class
subclass of: Oral Health
definition: A measure by clinical examination of the existence of the current inflammation of the hard (bone) and soft tissues that surround and support the teeth.
URL: https://www.phenxtoolkit.org/index.php
cui: C0031090
CADSR CDE: 2966642
LOINC: 62598-8

Professional Dental Care
type: Class
subclass of: Oral Health
definition: A measure to determine information about a participant's last visit to the dentist.
URL: https://www.phenxtoolkit.org/index.php
cui: C0237078
CADSR CDE: 2966647
LOINC: 62602-8

Arterial Blood Gas (ABG)
type: Class
subclass of: Respiratory
definition: An Arterial Blood Gas (ABG) test is performed using blood from an artery. The test is used to determine the pH of the blood, the partial pressure of carbon dioxide and oxygen, and the bicarbonate level. ABG testing is mainly used in critical care and pulmonary medicine, to assess oxygenation, ventilation, and acid-base status.
URL: https://www.phenxtoolkit.org/index.php
cui: C1299714
CADSR CDE: 2970285
LOINC: 62613-5

Bronchodilator Responsiveness (BDR)
type: Class
subclass of: Respiratory
definition: A measure to assess an individual's change in pulmonary function in response to inhaled bronchodilator medications.
URL: https://www.phenxtoolkit.org/index.php
cui: C1318620
CADSR CDE: 2970280
LOINC: 62615-0

Chest Computed Tomography (CT)
type: Class
subclass of: Respiratory
definition: Chest computed tomography (CT) is a painless, non-invasive test that creates precise images of the structures in the chest, such as the lungs.
URL: https://www.phenxtoolkit.org/index.php
cui: C0202823
CADSR CDE: 2969940
LOINC: 62617-6

Exercise Capacity/Six-Minute Walk Test
type: Class
subclass of: Respiratory
definition: The Six-Minute Walk Test measures the distance a person can walk in a period of six minutes.
URL: https://www.phenxtoolkit.org/index.php
cui: C0430515
CADSR CDE: 2970235
LOINC: 62619-2

Immunoglobulin E (Total and Specific)
type: Class
subclass of: Respiratory
definition: Immunoglobulin E (IgE) (Total and Specific) are the class of antibodies produced in the lungs, skin, and mucous membranes, and are responsible for allergic reactions.
URL: https://www.phenxtoolkit.org/index.php
cui: C0202086
CADSR CDE: 2970246
LOINC: 62621-8

Peak Expiratory Flow Rate (PEFR)
type: Class
subclass of: Respiratory
definition: The peak expiratory flow rate measures airflow (maximum speed of expiration) and the presence and degree of obstruction in the airways.
URL: https://www.phenxtoolkit.org/index.php
cui: C0030735
CADSR CDE: 2970241
LOINC: 62623-4

Personal and Family History of Respiratory Symptoms/Diseases
type: Class
subclass of: Respiratory
definition: Measure to assess the history of respiratory symptoms (i.e., cough, phlegm, shortness of breath, wheezing) and respiratory diseases.
URL: https://www.phenxtoolkit.org/index.php
cui: C0260470
CADSR CDE: 2969935, 2969935
LOINC: 62625-9, 62626-7

Substances - Age of First Use
type: Class
subclass of: Alcohol, Tobacco and Other Substances
definition: Question asking the respondent how old s/he was when he or she first used the substance.
URL: https://www.phenxtoolkit.org/index.php
cui: C1299544
CADSR CDE: 2821061
LOINC: 62507-9

Substances - Lifetime Abuse and Dependence
type: Class
subclass of: Alcohol, Tobacco and Other Substances
definition: Questions query respondent on whether s/he has signs of substance abuse and dependence.
URL: https://www.phenxtoolkit.org/index.php
cui: C1299544
CADSR CDE: 2821066
LOINC: 62511-1

Family History of Heart Attack
type: Class
PARENT UMLS CUI: C0683520
subclass of: Cardiovascular
definition: Measure to assess whether respondent's biological parents, siblings, and children have had a heart attack.
URL: https://www.phenxtoolkit.org/index.php
cui: C1392042
CADSR CDE: 2935311
LOINC: 62390-0

Lipid Profile
type: Class
subclass of: Cardiovascular
definition: Measure to identify lipid levels in samples of blood.
URL: https://www.phenxtoolkit.org/index.php
cui: C0430044
CADSR CDE: 2936262
LOINC: 62391-8

Blood Pressure (Adult/Primary)
type: Class
subclass of: Cardiovascular
definition: Measure to assess respondent's blood pressure.
URL: https://www.phenxtoolkit.org/index.php
cui: C0005823
CADSR CDE: 2935342
LOINC: 62392-6

High Blood Pressure During Pregnancy
type: Class
subclass of: Cardiovascular
definition: Measure to assess high blood pressure during pregnancy.
URL: https://www.phenxtoolkit.org/index.php
cui: C0005823
CADSR CDE: 2935349
LOINC: 62393-4

Heart Valve Function
type: Class
subclass of: Cardiovascular
definition: Measure to assess the structure and function of the heart valves.
URL: https://www.phenxtoolkit.org/index.php
cui: C0018824
CADSR CDE: 2935393
LOINC: 62394-2

Angina
type: Class
subclass of: Cardiovascular
definition: Measure to assess chest discomfort that may indicate the presence of angina.
URL: https://www.phenxtoolkit.org/index.php
cui: C0002962
CADSR CDE: 2935403
LOINC: 62395-9

Sudden Cardiac Arrest
type: Class
subclass of: Cardiovascular
definition: Measure to assess if patient died of sudden cardiac arrest.
URL: https://www.phenxtoolkit.org/index.php
cui: C1720824
CADSR CDE: 2935447
LOINC: 62396-7

Myocardial Infarction
type: Class
subclass of: Cardiovascular
definition: Measure to assess if patient had a myocardial infarction (heart attack).
URL: https://www.phenxtoolkit.org/index.php
cui: C0027051
CADSR CDE: 2935318
LOINC: 62397-5

Peripheral Arterial Disease
type: Class
subclass of: Cardiovascular
definition: Measure to assess presence of peripheral arterial disease.
URL: https://www.phenxtoolkit.org/index.php
cui: C1704436
CADSR CDE: 2935411
LOINC: 62398-3

Abdominal Aortic Aneurysm
type: Class
PARENT UMLS CUI: C0003486
subclass of: Cardiovascular
definition: This measure assesses the presence of an abdominal aortic aneurysm.
URL: https://www.phenxtoolkit.org/index.php
cui: C0162871
CADSR CDE: 2935420
LOINC: 62399-1

Arrhythmia (Atrial and Ventricular)
type: Class
subclass of: Cardiovascular
definition: Measure to assess irregular heart rhythms.
URL: https://www.phenxtoolkit.org/index.php
cui: C0003811
CADSR CDE: 2936257
LOINC: 62400-7

Deep Venous Thrombosis
type: Class
subclass of: Cardiovascular
definition: Measure to assess history of deep venous thrombosis.
URL: https://www.phenxtoolkit.org/index.php
cui: C0149871
CADSR CDE: 2935425
LOINC: 62401-5

Pulmonary Embolism
type: Class
subclass of: Cardiovascular
definition: Measure to assess the history of blood clots in the lungs, which is also known as pulmonary embolism.
URL: https://www.phenxtoolkit.org/index.php
cui: C0034065
CADSR CDE: 2935430
LOINC: 62402-3

Rheumatic Fever/Rheumatic Heart Disease
type: Class
subclass of: Cardiovascular
definition: This measure assesses the respondent's history of rheumatic fever or rheumatic heart disease.
URL: https://www.phenxtoolkit.org/index.php
cui: C0035436
CADSR CDE: 2935436
LOINC: 62403-1

Breastfeeding
type: Class
subclass of: Nutrition and Dietary Supplements
definition: A measure to assess whether a baby was breastfed, the duration of breastfeeding, and when solid foods were introduced.
URL: https://www.phenxtoolkit.org/index.php
cui: C0006147
CADSR CDE: 2944314
LOINC: 62279-5

Calcium Intake (Daily)
type: Class
subclass of: Nutrition and Dietary Supplements
definition: A measure to estimate an individual's daily average intake of calcium over the last 30 days as measured in milligrams.
URL: https://www.phenxtoolkit.org/index.php
cui: C0489458
CADSR CDE: 2944702, 2944681
LOINC: 61436-2, 62289-4

Caffeine Intake
type: Class
subclass of: Nutrition and Dietary Supplements
definition: A measure to estimate an individual's caffeine intake.
URL: https://www.phenxtoolkit.org/index.php
cui: C0948365
CADSR CDE: 2944784
LOINC: 62280-3

Dairy Food Intake (Daily Servings)
type: Class
subclass of: Nutrition and Dietary Supplements
definition: A measure to estimate an individual's daily average intake of dairy food over the last 30 days as measured in cup equivalents of milk.
URL: https://www.phenxtoolkit.org/index.php
cui: C0559267
CADSR CDE: 2946990
LOINC: 62281-1

Dietary Supplements Use
type: Class
subclass of: Nutrition and Dietary Supplements
definition: A measure to quantify intake from commonly consumed dietary supplements including vitamins, minerals, herbs or other botanicals, or a concentrate, metabolite, constituent, extract, or combination of these ingredients.
URL: https://www.phenxtoolkit.org/index.php
cui: C0242295
CADSR CDE: 2947016
LOINC: 62282-9

Fiber Intake
type: Class
subclass of: Nutrition and Dietary Supplements
definition: A measure to estimate an individual's daily average intake of fiber over the last 30 days as measured in grams.
URL: https://www.phenxtoolkit.org/index.php
cui: C0474451
CADSR CDE: 2944808
LOINC: 62283-7

Fruits and Vegetables Intake
type: Class
subclass of: Nutrition and Dietary Supplements
definition: A measure to estimate an individual's daily average intake of fruits and vegetables over the last 30 days as measured in cup equivalents.
URL: https://www.phenxtoolkit.org/index.php
cui: C1271941
CADSR CDE: 2947000
LOINC: 62284-5

Percent Energy from Fat
type: Class
subclass of: Nutrition and Dietary Supplements
definition: A measure to estimate an individual's usual intake of percentage energy from fat.
URL: https://www.phenxtoolkit.org/index.php
cui: C0012171
CADSR CDE: 2947019
LOINC: 62285-2

Selenium
type: Class
subclass of: Nutrition and Dietary Supplements
definition: A measure to assess concentration (micrograms per Liter or micromoles per Liter) of serum selenium.
URL: https://www.phenxtoolkit.org/index.php
cui: C0202466
CADSR CDE: 2946951
LOINC: 62287-8

Sugar Intake (Added)
type: Class
subclass of: Nutrition and Dietary Supplements
definition: A measure to approximate an individual's intake of added sugars quantified as teaspoon equivalents.
URL: https://www.phenxtoolkit.org/index.php
cui: C0556234
CADSR CDE: 2946975
LOINC: 62286-0

Vitamin D
type: Class
subclass of: Nutrition and Dietary Supplements
definition: A measure to assess serum vitamin D
URL: https://www.phenxtoolkit.org/index.php
cui: C0428586
CADSR CDE: 2946961
LOINC: 62288-6

Total Dietary Intake
type: Class
subclass of: Nutrition and Dietary Supplements
definition: A measure to assess the foods and beverages consumed throughout the previous day or the prior 24-hours.
URL: https://www.phenxtoolkit.org/index.php
cui: C1286104
CADSR CDE: 2946934
LOINC: 63074-9

Characteristics of Current Residence
type: Class
subclass of: Environmental Exposures
definition: Questions about the characteristics of the current residence.
URL: https://www.phenxtoolkit.org/index.php
cui: C0035181
CADSR CDE: 2954080
LOINC: 62514-5

Water Source
type: Class
subclass of: Environmental Exposures
definition: Questions asking about the drinking water source and use of water filtration systems in the respondent's home.
URL: https://www.phenxtoolkit.org/index.php
cui: C0599638
CADSR CDE: 2954138
LOINC: 62516-0

Residential History
type: Class
subclass of: Environmental Exposures
definition: Questions about the respondent's current and previous residences. Each residence is also geocoded.
URL: https://www.phenxtoolkit.org/index.php
cui: C0237096
CADSR CDE: 2954143
LOINC: 62518-6

Exposure at Work and in Daily Life
type: Class
PARENT UMLS CUI: C0014412
subclass of: Environmental Exposures
definition: A series of questions about being exposed to environmental substances at work or during daily activities
URL: https://www.phenxtoolkit.org/index.php
cui: C0028798
CADSR CDE: 2954148
LOINC: 62520-2

Exposures from Hobbies
type: Class
subclass of: Environmental Exposures
definition: Questions about particular hobbies in which the respondent participated in for 6 months or longer.
URL: https://www.phenxtoolkit.org/index.php
cui: C0019826
CADSR CDE: 2954167
LOINC: 62524-4

Current Environmental Tobacco Smoke Exposure
type: Class
subclass of: Environmental Exposures
definition: Questions that ask about smoking at the respondent's home and at work.
URL: https://www.phenxtoolkit.org/index.php
cui: C0813971
CADSR CDE: 2954172
LOINC: 62526-9

Sibship/Birth Order
type: Class
subclass of: Environmental Exposures
definition: Questions about the respondent's full siblings, those with whom the respondent shares both a birth mother and father, and the birth order of all siblings.
URL: https://www.phenxtoolkit.org/index.php
cui: C0005607
CADSR CDE: 2954182
LOINC: 62528-5

Day Care/Preschool Attendance
type: Class
subclass of: Environmental Exposures
definition: Questions about the child's attendance at day care and/or preschool.
URL: https://www.phenxtoolkit.org/index.php
cui: C0008070
CADSR CDE: 2954189
LOINC: 62530-1

History of Being Breast Fed
type: Class
subclass of: Environmental Exposures
definition: Question about whether or not the respondent was breastfed as a child.
URL: https://www.phenxtoolkit.org/index.php
cui: C0006147
CADSR CDE: 2954194
LOINC: 62532-7

Air Contaminants in the Home Environment
type: Class
subclass of: Environmental Exposures
definition: Questions about renovations to the home in the last year with optional questions about personal activities in the last 48 hours.
URL: https://www.phenxtoolkit.org/index.php
cui: C0337099
CADSR CDE: 2954201
LOINC: 62534-3

Dust Collection - Vacuum Bag
type: Class
subclass of: Environmental Exposures
definition: Self-administered collection of the respondent's vacuum bag for measurement of various environmental contaminants.
URL: https://www.phenxtoolkit.org/index.php
cui: C0524581
CADSR CDE: 2954207
LOINC: 62536-8

Ultraviolet Light Exposure
type: Class
subclass of: Environmental Exposures
definition: Questions about the respondent's exposure to the sun, use of tanning booths and sunlamps, and time spent outdoors.
URL: https://www.phenxtoolkit.org/index.php
cui: C1710524
CADSR CDE: 2954215
LOINC: 62538-4

Personal and Family History of Eye Disease and Treatments
type: Class
subclass of: Ocular
definition: This questionnaire assesses personal and family history among adults of glaucoma, macular degeneration, cataract, and diabetic retinopathy, including history of any associated laser or eye surgeries.
URL: https://www.phenxtoolkit.org/index.php
cui: C0015397
CADSR CDE: 3007655
LOINC: 62727-3

Intraocular Pressure
type: Class
subclass of: Ocular
definition: Procedure for the measurement of intraocular pressure (IOP) using the TONO-PEN XL Applanation Tonometer. TONO-PEN is a registered trademark Reichert, Inc.
URL: https://www.phenxtoolkit.org/index.php
cui: C0578862
CADSR CDE: 3008671
LOINC: 62691-1

Refractive Error Measurement
type: Class
subclass of: Ocular
definition: Measurement of image focusing error of the eye (refractive error)
URL: https://www.phenxtoolkit.org/index.php
cui: C0034951
CADSR CDE: 3008676, 3008676
LOINC: 62706-7, 62707-5

Retinal Digital Photography
type: Class
subclass of: Ocular
definition: A method to photograph (image) the retina, optic disc, macula, and posterior pole (i.e. the fundus) using a specialized lens system with a digital camera back.
URL: https://www.phenxtoolkit.org/index.php
cui: C0559963
CADSR CDE: 3008683
LOINC: 62709-1

Personal and Family History of Strabismus
type: Class
subclass of: Ocular
definition: Self-administered questions to assess personal and family history of strabismus.
URL: https://www.phenxtoolkit.org/index.php
cui: C0038379
CADSR CDE: 3007663
LOINC: 62696-0

Ocular Exposure to Ultraviolet Light
type: Class
subclass of: Ocular
definition: Questions to assess adult lifetime ocular ultraviolet light (UV)-B exposure during the middle of the day (10am-4pm) over the northern hemisphere summer months (April-September).
URL: https://www.phenxtoolkit.org/index.php
cui: C1154974
CADSR CDE: 3007673
LOINC: 62693-7

Visual Acuity
type: Class
subclass of: Ocular
definition: Measurement of clarity or sharpness of vision, which is the ability of the eye to see and distinguish fine details.
URL: https://www.phenxtoolkit.org/index.php
cui: C0042812
CADSR CDE: 3008688
LOINC: 62698-6

Visual Function
type: Class
subclass of: Ocular
definition: A base set of 25 questions, which can be expanded to 39 total questions, to determine vision-related function
URL: https://www.phenxtoolkit.org/index.php
cui: C0456753
CADSR CDE: 3007696
LOINC: 62700-0

General Psychiatric Assessment
type: Class
subclass of: Psychiatric
definition: A measure to screen for psychological pathology.
URL: https://www.phenxtoolkit.org/index.php
cui: C0302434
CADSR CDE: 3075381, 3075385
LOINC: 62712-5, 62713-3

Anxiety Disorders Screener
type: Class
subclass of: Psychiatric
definition: A questionnaire to assess anxiety disorders, which includes a number of different conditions such as panic disorder, generalized anxiety disorder, social phobia, specific phobia, agoraphobia, obsessive compulsive disorder, and post-traumatic stress disorder (American Psychiatric Association, 2000).
URL: https://www.phenxtoolkit.org/index.php
cui: C0003469
CADSR CDE: 3075424, 3075412
LOINC: 62715-8, 62716-6

Clinical Neuropathy Assessment
type: Class
subclass of: Neurology
definition: A physician administered examination to assess peripheral neuropathy.
URL: https://www.phenxtoolkit.org/index.php
cui: C0442874
CADSR CDE: 3076102
LOINC: 62759-6

History of Stroke - Ischemic Infarction and Hemorrhage
type: Class
subclass of: Neurology
definition: A questionnaire to determine if the respondent has had an ischemic infarction (i.e. stroke) and/or any symptoms related to this event.
URL: https://www.phenxtoolkit.org/index.php
cui: C0038454
CADSR CDE: 3076108
LOINC: 62761-2

Epilepsy Screener
type: Class
subclass of: Neurology
definition: A questionnaire to assess epilepsy, a condition characterized by recurrent seizures and which is a component of over 40 neurological disorders (Aminoff, et al., 2005).
URL: https://www.phenxtoolkit.org/index.php
cui: C0014544
CADSR CDE: 3076113
LOINC: 62763-8

Symptoms of Restless Legs Syndrome
type: Class
subclass of: Neurology
definition: This is a questionnaire to assess restless legs syndrome, which is an uncontrollable urge to move the legs to stop uncomfortable burning, itching, or tickling sensations.
URL: https://www.phenxtoolkit.org/index.php
cui: C0035258
CADSR CDE: 3076119
LOINC: 62786-9

History of Head Trauma
type: Class
subclass of: Neurology
definition: A questionnaire to determine whether an individual has had a traumatic brain injury (TBI).
URL: https://www.phenxtoolkit.org/index.php
cui: C0018674
CADSR CDE: 3076125
LOINC: 62767-9

Global Mental Status Screener
type: Class
subclass of: Neurology
definition: A test to assess the respondent's overall mental capability.
URL: https://www.phenxtoolkit.org/index.php
cui: C0278060
CADSR CDE: 3076130, 3076136
LOINC: 62769-5, 62770-3

Verbal Memory
type: Class
subclass of: Neurology
definition: An interviewer-administered test that measures to the ability of the respondent to recall words and spoken items.
URL: https://www.phenxtoolkit.org/index.php
CADSR CDE: 3076182
LOINC: 62772-9

Obsessive Compulsive Disorder Screener
type: Class
subclass of: Psychiatric
definition: A questionnaire to assess obsessive compulsive disorder, an anxiety disorder characterized by intrusive obsessions that cause distress or anxiety and compulsions that alleviate the distress (American Psychiatric Association, 2000).
URL: https://www.phenxtoolkit.org/index.php
cui: C0028768
CADSR CDE: 3075491
LOINC: 62718-2

Hypomania/Mania Symptoms
type: Class
subclass of: Psychiatric
definition: A questionnaire to assess hypomania (hypomanic episode), a disorder characterized by periods of persistently elevated, expansive, or irritable mood and can include inflated self-esteem, increased distractibility, talking and flight of ideas, and decreased need for sleep (American Psychiatric Association, 2000).
URL: https://www.phenxtoolkit.org/index.php
cui: C0338831
CADSR CDE: 3075434, 3075430
LOINC: 62720-8, 62721-6

Depression
type: Class
subclass of: Psychiatric
definition: A questionnaire to assess major depressive disorder (MDD), a mood disorder characterized by one or more major depressive episodes without manic, mixed or hypomanic episodes (American Psychiatric Association, 2000).
URL: https://www.phenxtoolkit.org/index.php
cui: C0011570
CADSR CDE: 3075438, 3075442
LOINC: 62723-2, 62724-0

Eating Disorders Screener
type: Class
subclass of: Psychiatric
definition: A questionnaire to assess eating disorders, including anorexia nervosa, which is a refusal to maintain normal weight, and bulimia nervosa characterized by episodes of binge eating followed by vomiting, use of laxatives, or fasting (American Psychiatric Association, 2000).
URL: https://www.phenxtoolkit.org/index.php
cui: C0013473
CADSR CDE: 3075447
LOINC: 62726-5

Schizophrenia Screener
type: Class
subclass of: Psychiatric
definition: A questionnaire to assess schizophrenia, a condition that lasts 6 months or more including a period of 1 month or more characterized by two or more of the following: delusions, hallucinations, disorganized speech, grossly disorganized behavior, catatonic behavior, or negative symptoms (American Psychiatric Association, 2000).
URL: https://www.phenxtoolkit.org/index.php
cui: C0036341
CADSR CDE: 3075453
LOINC: 62736-4

Pulse Oximetry (Exercise)
type: Class
subclass of: Respiratory
definition: Exercise testing for evaluation of hypoxemia and/or desaturation that occurs on exertion
URL: https://www.phenxtoolkit.org/index.php
cui: C0034108
CADSR CDE: 2970263
LOINC: 62628-3

Pulse Oximetry (Rest)
type: Class
subclass of: Respiratory
definition: Pulse Oximetry (Rest) is a non-invasive method to monitor the oxygenation of a patient's hemoglobin.
URL: https://www.phenxtoolkit.org/index.php
cui: C0034108
CADSR CDE: 2970255
LOINC: 62733-1

Quality of Life as Affected by Respiratory Disease
type: Class
subclass of: Respiratory
definition: Measure to assess the impact of respiratory problems on overall health and quality of life in the past three months.
URL: https://www.phenxtoolkit.org/index.php
cui: C0034380
CADSR CDE: 2970214
LOINC: 62630-9

Respiratory Rate
type: Class
subclass of: Respiratory
definition: Respiratory rate is the number of breaths an individual takes within a specific amount of time (frequently given in breaths per minute).
URL: https://www.phenxtoolkit.org/index.php
cui: C0231832
CADSR CDE: 2970219, 2970219, 2970219
LOINC: 62632-5, 62633-3, 62634-1

Sleep Apnea
type: Class
subclass of: Respiratory
definition: A measure to identify people with sleep apnea.
URL: https://www.phenxtoolkit.org/index.php
cui: C0522796
CADSR CDE: 2970224, 2970224
LOINC: 62636-6, 62637-4

Spirometry
type: Class
subclass of: Respiratory
definition: Spirometry is a common Pulmonary Function Test (PFT) measuring the amount (volume) and/or speed (flow) of air being inhaled and exhaled.
URL: https://www.phenxtoolkit.org/index.php
cui: C0037981
CADSR CDE: 2970229
LOINC: 62639-0

Urine Assay for Tobacco Smoke Exposure
type: Class
subclass of: Respiratory
definition: Cotinine is a biomarker to quantify recent exposure to tobacco smoke.
URL: https://www.phenxtoolkit.org/index.php
CADSR CDE: 3061171
LOINC: 62641-6

Assessment of Pubertal Development
type: Class
subclass of: Reproductive Health
definition: Separate male and female specific protocols to assess stage of puberty. Stage of puberty can be assessed by pubic hair, female breast development, and the size and shape of the male testes.
URL: https://www.phenxtoolkit.org/index.php
cui: C0034011
CADSR CDE: 3007416, 3007416
LOINC: 62644-0, 62645-7

Causes and Treatments of Known Infertility
type: Class
subclass of: Reproductive Health
definition: Questions to assess participant's experience with infertility
URL: https://www.phenxtoolkit.org/index.php
cui: C0021359
CADSR CDE: 3007421
LOINC: 62647-3

Symptoms of Autism Spectrum Disorders
type: Class
subclass of: Psychiatric
definition: A questionnaire to assess autism spectrum disorders (ASD), a group of developmental problems that includes autism, Asperger's syndrome, Rett syndrome and the category of Pervasive Developmental Disorders Not Otherwise Specified. Autism spectrum disorders are characterized by a lack of social interaction, difficulties in verbal and nonverbal communication, and restricted, repetitive, and stereotyped patterns of behavior (American Psychiatric Association, 2000).
URL: https://www.phenxtoolkit.org/index.php
cui: C1510586
CADSR CDE: 3075509, 3075507, 3075511
LOINC: 62738-0, 62739-8, 62740-6

Sleep Disorders Screener
type: Class
subclass of: Psychiatric
definition: A questionnaire to assess sleep disorders, a broad group of disorders that can be caused by endogenous disturbances in the sleep-wake or timing cycles (American Psychiatric Association, 2000).
URL: https://www.phenxtoolkit.org/index.php
cui: C0851578
CADSR CDE: 3075469
LOINC: 62742-2

Personality Traits
type: Class
subclass of: Psychiatric
definition: A questionnaire to assess personality traits.
URL: https://www.phenxtoolkit.org/index.php
cui: C0031212
CADSR CDE: 3075475
LOINC: 62744-8

Psychopathy
type: Class
subclass of: Psychiatric
definition: This is a questionnaire to assess psychopathy (psychopathic personality). Individuals high in psychopathy are socially facile but emotionally insensitive, egocentric, lacking in affection or concern for others, deceitful and manipulative, forceful and aggressive, venturesome, impulsive, and irresponsible (American Psychiatric Association, 2000; Hare, 2003; Lilienfeld & Andrews, 1996; Patrick, Fowles, & Krueger, 2009).
URL: https://www.phenxtoolkit.org/index.php
cui: C0003431
CADSR CDE: 3075496
LOINC: 62753-9

General Distress Screener
type: Class
subclass of: Psychiatric
definition: A measure to assess symptoms of nonspecific psychological distress.
URL: https://www.phenxtoolkit.org/index.php
cui: C0231303
CADSR CDE: 3075479
LOINC: 62746-3

Posttraumatic Stress Disorder (PTSD)
type: Class
subclass of: Psychiatric
definition: This is a questionnaire to assess posttraumatic stress disorder (PTSD), an anxiety disorder characterized by reliving a terrifying event- such as violent personal assaults, natural or human-caused disasters, accidents, or military combat - and avoiding associated situations (American Psychiatric Association, 2000).
URL: https://www.phenxtoolkit.org/index.php
cui: C0038436
CADSR CDE: 3075485
LOINC: 62748-9

Attention-Deficit/Hyperactivity Disorder Symptoms
type: Class
subclass of: Psychiatric
definition: A questionnaire to assess attention-deficit/hyperactivity disorder (ADHD), a condition characterized by patterns of inattention, hyperactivity, and impulsivity that is more pronounced than in other individuals at similar developmental levels (American Psychiatric Association, 2000).
URL: https://www.phenxtoolkit.org/index.php
cui: C1263846
CADSR CDE: 3075460, 3075464
LOINC: 62750-5, 62751-3

Parkinsonism Symptoms
type: Class
subclass of: Neurology
definition: A physical examination to assess Parkinsonism symptoms, including resting tremor, resistance to movement, slowed voluntary and automatic movement, and abnormal gait and posture.
URL: https://www.phenxtoolkit.org/index.php
cui: C0242422
CADSR CDE: 3076084
LOINC: 62757-0

Signs of Essential Tremor
type: Class
subclass of: Neurology
definition: This is an examination to assess essential tremor, which is involuntary movement of one or more body parts, such as the head, arms, or legs.
URL: https://www.phenxtoolkit.org/index.php
cui: C0270736
CADSR CDE: 3107307
LOINC: 62784-4

Contraceptive Methods
type: Class
subclass of: Reproductive Health
definition: Questions to assess participants' use of contraception.
URL: https://www.phenxtoolkit.org/index.php
cui: C0700589
CADSR CDE: 3007431, 3007431
LOINC: 62650-7, 62651-5

Difficulty in Conceiving
type: Class
subclass of: Reproductive Health
definition: Questions to assess length of time male and female partners have been trying to get pregnant.
URL: https://www.phenxtoolkit.org/index.php
cui: C0021359
CADSR CDE: 3007441
LOINC: 62653-1

Female Reproductive Organ Surgical Procedures
type: Class
subclass of: Reproductive Health
definition: Questions to assess whether the participant has had a hysterectomy or has had her ovaries removed.
URL: https://www.phenxtoolkit.org/index.php
cui: C0920758
CADSR CDE: 3007446
LOINC: 62655-6

Hormonal Therapy
type: Class
subclass of: Reproductive Health
definition: A question to determine whether a female has ever taken hormonal therapy for treatment or prevention of cancer, or for another reason. As hormonal therapy is known to affect risk of cardiovascular disease and cancer, it is an important environmental risk factor for women.
URL: https://www.phenxtoolkit.org/index.php
cui: C1516999
CADSR CDE: 3007460
LOINC: 62660-6

Human Papillomavirus Vaccine Use
type: Class
subclass of: Reproductive Health
definition: Questions to assess women's use of the human papillomavirus vaccine.
URL: https://www.phenxtoolkit.org/index.php
cui: C1512511
CADSR CDE: 3007465
LOINC: 62662-2

History of Prepubertal Development
type: Class
subclass of: Reproductive Health
definition: Questions to assess how old participants were when they reached puberty.
URL: https://www.phenxtoolkit.org/index.php
cui: C0233888
CADSR CDE: 3007456, 3007456
LOINC: 62657-2, 62658-0

Male Reproductive Tract Birth Defects
type: Class
subclass of: Reproductive Health
definition: Questions to determine whether a male participant has ever had certain conditions that could have developed in utero. Cryptorchidism is failure of one or both of the testes to descend into the scrotum. Hypospadius is a developmental anomaly in which the male urethra opens on the underside of the penis or on the perineum.
URL: https://www.phenxtoolkit.org/index.php
cui: C0220810
CADSR CDE: 3007471
LOINC: 62664-8

Menstrual History
type: Class
subclass of: Reproductive Health
definition: Questions to determine a female's menstrual history including disruptions to her menstrual cycle.
URL: https://www.phenxtoolkit.org/index.php
cui: C1954761
CADSR CDE: 3007481
LOINC: 62668-9

Prostate Health
type: Class
subclass of: Reproductive Health
definition: Questions to assess males' prostate health
URL: https://www.phenxtoolkit.org/index.php
cui: C0426730
CADSR CDE: 3007486
LOINC: 62670-5

Reproductive History
type: Class
subclass of: Reproductive Health
definition: Question to assess both male and females' pregnancy history. Females are asked about the number of pregnancies, description of pregnancies and smoking during pregnancy. Males are asked whether they have ever fathered a pregnancy and, if so, the description of the pregnancy.
URL: https://www.phenxtoolkit.org/index.php
cui: C0206076
CADSR CDE: 3007491, 3007491
LOINC: 62676-2, 63071-5

Male Sexual Function
type: Class
subclass of: Reproductive Health
definition: Questions to determine whether a male participant has certain types of sexual function difficulties.
URL: https://www.phenxtoolkit.org/index.php
cui: C0278095
CADSR CDE: 3007476
LOINC: 62666-3

Sexual History
type: Class
subclass of: Reproductive Health
definition: The purpose of these questions is to ascertain the participants' sexual history.
URL: https://www.phenxtoolkit.org/index.php
cui: C0036864
CADSR CDE: 3007496
LOINC: 62674-7

Testes Development
type: Class
subclass of: Reproductive Health
definition: The orchidometer is one method used to measure testes size which is an indication of testes development. The orchidometer consists of a string of twelve numbered wooden or plastic elipsoid beads of increasing size measured as volume.
URL: https://www.phenxtoolkit.org/index.php
cui: C1963704
CADSR CDE: 3007491
LOINC: 62676-2

Contact Biometry
type: Class
subclass of: Ocular
definition: Axial length of the eye and central corneal thickness is measured using contact biometry and pachymetry. Depth of the anterior chamber, lens thickness and depth of the posterior chamber can also be obtained.
URL: https://www.phenxtoolkit.org/index.php
cui: C0429494
CADSR CDE: 3008662
LOINC: 62679-6

Color Vision
type: Class
subclass of: Ocular
definition: A screening test to determine color blindness.
URL: https://www.phenxtoolkit.org/index.php
cui: C0086032
CADSR CDE: 3008667
LOINC: 62681-2

Corrective Lens Use
type: Class
subclass of: Ocular
definition: Questions to assess current and past use of eyeglasses and/or contact lenses.
URL: https://www.phenxtoolkit.org/index.php
cui: C0009836
CADSR CDE: 3008657, 3008657, 3008657
LOINC: 62702-6, 62728-1, 62704-2

Dry Eye Syndrome
type: Class
subclass of: Ocular
definition: Questions to assess if the participant has dry eye syndrome
URL: https://www.phenxtoolkit.org/index.php
cui: C0013238
CADSR CDE: 3007556
LOINC: 62683-8

Eye Diseases and Treatment in Young Children
type: Class
subclass of: Ocular
definition: Questions to assess various eye diseases and treatments in very young children
URL: https://www.phenxtoolkit.org/index.php
cui: C0015397
CADSR CDE: 3007562
LOINC: 62685-3

Eye Drop Use
type: Class
subclass of: Ocular
definition: Questions to determine current and recent eye drop use
URL: https://www.phenxtoolkit.org/index.php
cui: C0015399
CADSR CDE: 3007567
LOINC: 62687-9

Eye Patching
type: Class
subclass of: Ocular
definition: Questions to assess history of eye patching, which is used to treat amblyopia ("lazy eye").
URL: https://www.phenxtoolkit.org/index.php
cui: C0776981
CADSR CDE: 3007573
LOINC: 62689-5

Visual Memory
type: Class
subclass of: Neurology
definition: An interviewer-administered test that measures the ability of the respondent to remember images and pictures.
URL: https://www.phenxtoolkit.org/index.php
cui: C1287462
CADSR CDE: 3076187
LOINC: 62774-5

Working Memory
type: Class
subclass of: Neurology
definition: An interviewer-administered test that measures the ability of the respondent to process and retrieve information associated with short-term memory.
URL: https://www.phenxtoolkit.org/index.php
cui: C0025265
CADSR CDE: 3076192
LOINC: 62776-0

Executive Function
type: Class
subclass of: Neurology
definition: An interviewer-administered, two-part test to measure a respondent's system of high-level cognitive functions that controls other, more basic abilities and functions such as abstract thinking, rule acquisition, cognitive flexibility and goal-oriented behavior.
URL: https://www.phenxtoolkit.org/index.php
cui: C0935584
CADSR CDE: 3076197
LOINC: 62778-6

Gross Motor Function
type: Class
subclass of: Neurology
definition: A questionnaire to assess the larger body movements that develop during childhood such as sitting, standing and walking.
URL: https://www.phenxtoolkit.org/index.php
cui: C0677549
CADSR CDE: 3076202, 3076202, 3076202
LOINC: 62780-2, 62781-0, 62782-8

Oral Glucose Tolerance Test
type: Class
subclass of: Diabetes
definition: A bioassay to measure the concentration of plasma glucose 2 hours after drinking a dextrose solution.
URL: https://www.phenxtoolkit.org/index.php
cui: C0029161
CADSR CDE: 3070859
LOINC: 62856-0

Fasting C-peptide Assay for Residual Beta Cell Function
type: Class
subclass of: Diabetes
definition: A bioassay to measure serum concentration of C-peptide (connecting peptide), a small peptide that is cleaved from the proinsullin protein to form an active insulin protein. This peptide is produced by the pancreas as a by-product of insulin processing.
URL: https://www.phenxtoolkit.org/index.php
cui: C0202100
CADSR CDE: 3070892
LOINC: 62803-2

Fasting Serum Insulin
type: Class
subclass of: Diabetes
definition: A bioassay to measure serum concentration of insulin, a hormone produced by pancreatic beta cells that regulates the body's ability to metabolize glucose.
URL: https://www.phenxtoolkit.org/index.php
cui: C0428357
CADSR CDE: 3070721
LOINC: 62805-7

Serum Creatinine Assay for Kidney Function
type: Class
subclass of: Diabetes
definition: A bioassay to measure the serum concentration of creatinine, a metabolite of muscle creatine that is filtered out of blood by the kidneys.
URL: https://www.phenxtoolkit.org/index.php
cui: C0600061
CADSR CDE: 2655822
LOINC: 62807-3

Urinary Microalbumin Assay for Kidney Function
type: Class
subclass of: Diabetes
definition: A bioassay to measure urine concentration of albumin, which is produced by the liver and is the most abundant protein in the blood.
URL: https://www.phenxtoolkit.org/index.php
cui: C0523780
CADSR CDE: 3070901
LOINC: 62809-9

Alkaline Phosphatase
type: Class
PARENT UMLS CUI: C0002059
subclass of: Skin, Bone, Muscle and Joint
definition: This measure is a bioassay to determine the concentration of alkaline phosphatase in serum or plasma.
URL: https://www.phenxtoolkit.org/index.php
cui: C0036776
CADSR CDE: 58313
LOINC: 62898-2

Arthritis/Osteoarthritis
type: Class
subclass of: Skin, Bone, Muscle and Joint
definition: This is a measure to obtain unilateral or bilateral knee, hand, and pelvic (for hip joint) radiographs (X-rays) and to interpret the radiographs to determine the level of osteoarthritis.
URL: https://www.phenxtoolkit.org/index.php
cui: C0003864
CADSR CDE: 3158223
LOINC: 62900-6

Balance
type: Class
subclass of: Skin, Bone, Muscle and Joint
definition: This measure tests the respondent's ability to maintain his/her balance while standing on one leg.
URL: https://www.phenxtoolkit.org/index.php
cui: C0014653
CADSR CDE: 3182293
LOINC: 64388-2

Spine and Femur Bone Density by Dual-Energy X-ray Absorptiometry
type: Class
PARENT UMLS CUI: C0005938
subclass of: Skin, Bone, Muscle and Joint
definition: This is a measure to obtain spine and femur dual-energy X-ray absorptiometry (DXA) scans to assess bone mineral density.
URL: https://www.phenxtoolkit.org/index.php
cui: C0730031
CADSR CDE: 3158227, 3158231
LOINC: 62910-5

Eczema
type: Class
subclass of: Skin, Bone, Muscle and Joint
definition: This measure is a physical examination of four areas of the body to determine whether the respondent has atopic eczema and to assess the severity of the disease.
URL: https://www.phenxtoolkit.org/index.php
cui: C0013595
CADSR CDE: 3158234
LOINC: 62902-2

Fracture History
type: Class
PARENT UMLS CUI: C0016658
subclass of: Skin, Bone, Muscle and Joint
definition: This measure contains a questionnaire to determine the respondent's history of bone fractures and follow up confirmation by medical record abstraction.
URL: https://www.phenxtoolkit.org/index.php
cui: C2349852
CADSR CDE: 3158250
LOINC: 64390-8

Systemic Lupus Erythematosus
type: Class
subclass of: Skin, Bone, Muscle and Joint
definition: This measure is a clinical assessment of individuals with systemic lupus erythematosus (SLE, or lupus) to determine the level of organ damage due to the disease.
URL: https://www.phenxtoolkit.org/index.php
cui: C0024141
CADSR CDE: 3182299
LOINC: 64392-4

Pain
type: Class
subclass of: Skin, Bone, Muscle and Joint
definition: This measure is a questionnaire to determine the presence, location, and intensity of body pain, and the extent to which this pain has affected various aspects of the respondent's life.
URL: https://www.phenxtoolkit.org/index.php
cui: C0030193
CADSR CDE: 3158263
LOINC: 62904-8

Personal and Family History of Psoriasis
type: Class
PARENT UMLS CUI: C0033860
subclass of: Skin, Bone, Muscle and Joint
definition: This measure consists of a questionnaire to determine the respondent's personal and family history of psoriasis and other autoimmune diseases, as well as current symptoms and medication use and its effectiveness.
URL: https://www.phenxtoolkit.org/index.php
cui: C0455439
CADSR CDE: 3158267, 3158275
LOINC: 62906-3

Skin Cancer
type: Class
subclass of: Skin, Bone, Muscle and Joint
definition: This measure consists of a questionnaire and a physical examination to determine whether respondents are at risk for developing melanoma.
URL: https://www.phenxtoolkit.org/index.php
cui: C0007114
CADSR CDE: 3158308
LOINC: 62908-9

Perceived Social Support/Conflict
type: Class
subclass of: Psychosocial
definition: These questions are used to measure both perceived positive and negative social interactions with three individuals/groups: (1) spouse or partner; (2) other members of the family; and (3) friends.
URL: https://www.phenxtoolkit.org/index.php
cui: C0037438
CADSR CDE: 3162998
LOINC: 62929-5

Acculturation
type: Class
subclass of: Psychosocial
definition: This measure is used to provide a language indicator (one of several ways of indexing acculturation) of the extent to which an individual (or the children/relatives of an immigrant) who has moved from a non-English-speaking culture/country to an English-speaking one has adopted the culture of the "receiving" country.
URL: https://www.phenxtoolkit.org/index.php
cui: C0000943
CADSR CDE: 3163002
LOINC: 62913-9

Social Isolation
type: Class
subclass of: Psychosocial
definition: This is a scale used to assess feelings of loneliness or social isolation.
URL: https://www.phenxtoolkit.org/index.php
cui: C0037421
CADSR CDE: 3163008
LOINC: 62933-7

Emotional State
type: Class
subclass of: Psychosocial
definition: This measure assesses positive and negative aspects of a person's mood.
URL: https://www.phenxtoolkit.org/index.php
cui: C0935620
CADSR CDE: 3163014, 3163015
LOINC: 62923-8, 62924-6

Current Quality of Life
type: Class
subclass of: Psychosocial
definition: This is a measure of an individual's perceived general physical and mental health during the past 30 days.
URL: https://www.phenxtoolkit.org/index.php
cui: C0281588
CADSR CDE: 3163019
LOINC: 62918-8

Temperament
type: Class
subclass of: Psychosocial
definition: This is a measure used to assess individual differences in emotional and motor reactivity and the attentional capacities that support self-regulation.
URL: https://www.phenxtoolkit.org/index.php
cui: C0039474
CADSR CDE: 3162869, 3162870, 3162871, 3371990
LOINC: 62935-2, 62936-0, 62937-8

Disinhibiting Behaviors - Impulsivity
type: Class
PARENT UMLS CUI: C0424296
subclass of: Psychosocial
definition: This is an assessment with five subscales that are used to measure five distinct dimensions of impulsive behavior.
URL: https://www.phenxtoolkit.org/index.php
cui: C0815111
CADSR CDE: 3162877, 3162878
LOINC: 62920-4, 62921-2

Self-esteem
type: Class
subclass of: Psychosocial
definition: This is a measure of positive or negative perceptions about oneself, which is often referred to as global self-esteem.
URL: https://www.phenxtoolkit.org/index.php
cui: C0036597
CADSR CDE: 3162882
LOINC: 62931-1

General Self-Efficacy
type: Class
subclass of: Psychosocial
definition: This is a measure of an individual's belief about whether problems or barriers can be confronted and addressed with a successful outcome.
URL: https://www.phenxtoolkit.org/index.php
cui: C0600564
CADSR CDE: 3162914, 3162915
LOINC: 62926-1, 62927-9

Tinnitus
type: Class
PARENT UMLS CUI: C0260662
subclass of: Speech and Hearing
definition: This measure is a questionnaire to assess tinnitus, or ringing in the ear(s).
URL: https://www.phenxtoolkit.org/index.php
cui: C0040264
CADSR CDE: 3139254
LOINC: 62998-0

Stuttering
type: Class
PARENT UMLS CUI: C0233715,C0338980
subclass of: Speech and Hearing
definition: This measure assesses the severity of the respondent's stuttering.
URL: https://www.phenxtoolkit.org/index.php
cui: C0038506
CADSR CDE: 3139260
LOINC: 62996-4

Early Childhood Speech and Language Assessment
type: Class
PARENT UMLS CUI: C0233715,C0338980
subclass of: Speech and Hearing
definition: This measure is a questionnaire to assess the development of speech and language skills.
URL: https://www.phenxtoolkit.org/index.php
cui: C0856622
CADSR CDE: 3139265, 3139269
LOINC: 62981-6, 62982-4

Phonemic Inventory
type: Class
PARENT UMLS CUI: C0233715,C0338980
subclass of: Speech and Hearing
definition: This measure assesses an individual's articulation of consonant sounds.
URL: https://www.phenxtoolkit.org/index.php
cui: C0003910
CADSR CDE: 3139273
LOINC: 62992-3

Vocabulary Assessment
type: Class
PARENT UMLS CUI: C0233715,C0338980
subclass of: Speech and Hearing
definition: This measure is a test that assesses an individual's understanding of the spoken English language.
URL: https://www.phenxtoolkit.org/index.php
cui: C0042927
CADSR CDE: 3144923
LOINC: 63002-0

Grammatical Impairments
type: Class
PARENT UMLS CUI: C0454651,C1865889
subclass of: Speech and Hearing
definition: This measure is a test that assesses the respondent's knowledge of grammar.
URL: https://www.phenxtoolkit.org/index.php
cui: C0338980
CADSR CDE: 3144927, 3144919, 3162087
LOINC: 62986-5, 62987-3, 62988-1

Non-word Repetition
type: Class
subclass of: Speech and Hearing
definition: This measure is a test to assess the ability of the respondent to repeat multi-syllable nonsense words.
URL: https://www.phenxtoolkit.org/index.php
cui: C0561770
CADSR CDE: 3144933
LOINC: 62990-7

Reading Comprehension
type: Class
PARENT UMLS CUI: C0476254,C0920296
subclass of: Speech and Hearing
definition: This measure assesses the ability of an individual to understand what he or she reads.
URL: https://www.phenxtoolkit.org/index.php
cui: C0338980
CADSR CDE: 3139277
LOINC: 62994-9

Word Decoding
type: Class
PARENT UMLS CUI: C0920296
subclass of: Speech and Hearing
definition: This measure is a test to assess the respondent's ability to pronounce words accurately.
URL: https://www.phenxtoolkit.org/index.php
cui: C0338980
CADSR CDE: 3144938
LOINC: 63006-1

Personal and Family History of Hearing Loss
type: Class
subclass of: Speech and Hearing
definition: This measure is a questionnaire to assess risk factors related to hearing loss.
URL: https://www.phenxtoolkit.org/index.php
cui: C0260662
CADSR CDE: 3139286
LOINC: 63008-7

Family History of Speech and Language Impairment
type: Class
subclass of: Speech and Hearing
definition: This measure is a questionnaire to identify family history of speech and language impairment.
URL: https://www.phenxtoolkit.org/index.php
cui: C0338980
CADSR CDE: 3139293
LOINC: 62984-0

Voice Impairments
type: Class
subclass of: Speech and Hearing
definition: This measure is a questionnaire to assess the functional, emotional, and psychosocial consequences of voice disorders.
URL: https://www.phenxtoolkit.org/index.php
cui: C0042940
CADSR CDE: 3144942
LOINC: 63004-6

Vertigo
type: Class
subclass of: Speech and Hearing
definition: This measure is a questionnaire to assess perceived disability due to dizziness.
URL: https://www.phenxtoolkit.org/index.php
cui: C0042571
CADSR CDE: 3139297
LOINC: 63000-4

Audiogram Hearing Test
type: Class
PARENT UMLS CUI: C0260662
subclass of: Speech and Hearing
definition: This measure is a hearing test to assess hearing sensitivity.
URL: https://www.phenxtoolkit.org/index.php
cui: C0004286
CADSR CDE: 3144946
LOINC: 62977-4

Ear Infections (Otitis Media)
type: Class
PARENT UMLS CUI: C0260662
subclass of: Speech and Hearing
definition: This measure is a questionnaire to assess the respondent's history of middle ear infections and tube insertions in the ears.
URL: https://www.phenxtoolkit.org/index.php
cui: C0029882
CADSR CDE: 3139302
LOINC: 62979-0

Urinary Creatinine Assay for Kidney Function
type: Class
subclass of: Diabetes
definition: A bioassay to measure urine concentration of creatinine, a muscle metabolite that is filtered out of blood by the kidneys.
URL: https://www.phenxtoolkit.org/index.php
cui: C1318439
CADSR CDE: 2183351
LOINC: 62811-5

Cardiorespiratory Fitness - Exercise Test Estimate
type: Class
subclass of: Physical Activity and Physical Fitness
definition: A measure to estimate maximal oxygen consumption (VO2max).
URL: https://www.phenxtoolkit.org/index.php
cui: C0846599
CADSR CDE: 3060845, 3060850
LOINC: 62814-9, 62815-6

Integrated Fitness
type: Class
subclass of: Physical Activity and Physical Fitness
definition: A measure to assess muscle strength, endurance, flexibility, and agility or balance.
URL: https://www.phenxtoolkit.org/index.php
cui: C1301988
CADSR CDE: 3061251, 3061264, 3107315
LOINC: 62817-2, 62818-0, 62819-8

Muscle Strength
type: Class
subclass of: Physical Activity and Physical Fitness
definition: A measure of maximum hand grip strength used to assess a person's overall muscle strength.
URL: https://www.phenxtoolkit.org/index.php
cui: C0517349
CADSR CDE: 3061229
LOINC: 62821-4

Physical Activity Readiness
type: Class
subclass of: Physical Activity and Physical Fitness
definition: A measure to determine if the person needs to see a doctor prior to an increase in physical activity or fitness appraisal.
URL: https://www.phenxtoolkit.org/index.php
cui: C1301988
CADSR CDE: 3061239
LOINC: 62823-0

Physical Functioning-Objective
type: Class
subclass of: Physical Activity and Physical Fitness
definition: An objective tool used to measure lower extremity function in older adults.
URL: https://www.phenxtoolkit.org/index.php
cui: C1301988
CADSR CDE: 3061246
LOINC: 62825-5

Sitting/Sedentary Behavior
type: Class
subclass of: Physical Activity and Physical Fitness
definition: An estimate of the amount of time a person spends doing sedentary activities during a typical day or week.
URL: https://www.phenxtoolkit.org/index.php
cui: C3166132
CADSR CDE: 3060839, 3060835
LOINC: 62827-1, 62828-9

Total Physical Activity-Comprehensive
type: Class
subclass of: Physical Activity and Physical Fitness
definition: An assessment of all recent physical activities and the intensity of those activities.
URL: https://www.phenxtoolkit.org/index.php
cui: C1301988
CADSR CDE: 3060769, 3060781, 3060791
LOINC: 62830-5, 62831-3, 62832-1

Total Physical Activity-Objective Measure
type: Class
subclass of: Physical Activity and Physical Fitness
definition: Physical movements measured by accelerometer(s).
URL: https://www.phenxtoolkit.org/index.php
cui: C1301988
CADSR CDE: 3060825
LOINC: 62834-7

Total Physical Activity-Screener
type: Class
subclass of: Physical Activity and Physical Fitness
definition: A two-question screening tool used to assess a person's physical activity level.
URL: https://www.phenxtoolkit.org/index.php
cui: C1301988
CADSR CDE: 3060755
LOINC: 62836-2

Walking-Ambulation Objective Measure
type: Class
subclass of: Physical Activity and Physical Fitness
definition: The total number of steps a person takes in a defined period.
URL: https://www.phenxtoolkit.org/index.php
cui: C0080331
CADSR CDE: 3060830
LOINC: 62838-8

Physical Functioning-Subjective
type: Class
subclass of: Physical Activity and Physical Fitness
definition: A measure to determine if a person has difficulty performing everyday activities.
URL: https://www.phenxtoolkit.org/index.php
cui: C1301988
CADSR CDE: 3061275
LOINC: 62840-4

Physical Activity -Neighborhood Environment
type: Class
subclass of: Physical Activity and Physical Fitness
definition: This is a measure of neighborhood characteristics that influence physical activity.
URL: https://www.phenxtoolkit.org/index.php
cui: CL106540
CADSR CDE: 3107329
LOINC: 62842-0

Physical Activity Self-Efficacy
type: Class
subclass of: Physical Activity and Physical Fitness
definition: This is a measure of a person's confidence in his or her ability to exercise on a regular basis.
URL: https://www.phenxtoolkit.org/index.php
cui: C1301988
CADSR CDE: 3107320, 3107324
LOINC: 62844-6, 62845-3

Cardiorespiratory Fitness - Non-Exercise Test Estimate
type: Class
subclass of: Physical Activity and Physical Fitness
definition: This is a measure of aerobic capacity that combines anthropometric measurements with self-reported physical activity to estimate cardiorespiratory fitness.
URL: https://www.phenxtoolkit.org/index.php
CADSR CDE: 3107311
LOINC: 62847-9

Human Immunodeficiency Virus (HIV)
type: Class
subclass of: Infectious Diseases and Immunity
definition: This is a bioassay to measure human immunodeficiency virus (HIV) antibodies.
URL: https://www.phenxtoolkit.org/index.php
cui: C0459958
CADSR CDE: 2180464
LOINC: 62882-6

Personal and Family History of Autoimmune and Inflammatory Disorders
type: Class
subclass of: Infectious Diseases and Immunity
definition: This measure is a symptom, disease, and condition checklist to assess a respondent's personal and family history of autoimmune and inflammatory disorders.
URL: https://www.phenxtoolkit.org/index.php
cui: C1290884
CADSR CDE: 3151168, 3151169, 3151170, 3151171
LOINC: 62892-5

Assay for Human Leukocyte Antigen (HLA) Genotyping
type: Class
subclass of: Infectious Diseases and Immunity
definition: A bioassay to obtain the specific allelic genotypes of several of the human leukocyte antigens, whose genes reside on chromosome 6p within the Major Histocompatibility Region (MHC).
URL: https://www.phenxtoolkit.org/index.php
cui: C0427359
CADSR CDE: 2693490, 2693496, 2693498, 2693500, 2693516, 2693520, 2704113, 2704130, 2704165, 2704192, 2705042
LOINC: 62875-0

International Travel History
type: Class
subclass of: Infectious Diseases and Immunity
definition: This measure is a questionnaire to collect data on a respondent's international travel in the past 6 months and the last 5 years and a clinical assessment of the exposure details.
URL: https://www.phenxtoolkit.org/index.php
cui: C0239685
CADSR CDE: 3151204
LOINC: 62888-3

Injection Drug Use
type: Class
subclass of: Infectious Diseases and Immunity
definition: This measure is a questionnaire to assess whether a respondent has ever used a needle to inject drugs not prescribed by a physician.
URL: https://www.phenxtoolkit.org/index.php
cui: C0242566
CADSR CDE: 3151300
LOINC: 62886-7

Immunizations
type: Class
subclass of: Infectious Diseases and Immunity
definition: This measure is a questionnaire to collect information on a respondent's personal medical history of immunizations.
URL: https://www.phenxtoolkit.org/index.php
cui: C0020971
CADSR CDE: 3151222
LOINC: 62884-2

Assay for Chlamydia/Gonorrhea
type: Class
subclass of: Infectious Diseases and Immunity
definition: A bioassay to measure Chlamydia trachomatis and Neisseria gonorrhoeae, sexually transmitted bacterial diseases.
URL: https://www.phenxtoolkit.org/index.php
cui: C1445929
CADSR CDE: 3151324, 3153202
LOINC: 62865-1

Assay for Herpes Simplex Virus Types 1 and 2
type: Class
subclass of: Infectious Diseases and Immunity
definition: This is a bioassay to measure herpes simplex virus type 1 (HSV-1) and type 2 (HSV-2). HSV-1 causes infections of the lips and mouth, such as cold sores and fever blisters. It is transmitted through saliva. Both HSV-1 and HSV-2 can cause genital herpes, a sexually transmitted disease (STD). Most genital herpes is caused by HSV-2.
URL: https://www.phenxtoolkit.org/index.php
cui: C0750707
CADSR CDE: 2180471
LOINC: 62873-5

Assay for Syphilis
type: Class
subclass of: Infectious Diseases and Immunity
definition: This is a bioassay to measure past or current infection with Treponema pallidum, the bacterium that causes syphilis.
URL: https://www.phenxtoolkit.org/index.php
cui: C1320456
CADSR CDE: 2695088
LOINC: 62877-6

Assay for Cytokine Panel 12
type: Class
subclass of: Infectious Diseases and Immunity
definition: This is a bioassay to measure 12 different cytokines: Interferon gamma (IFN-gamma), Interleukin-1 beta (IL-1 beta), Interleukin-10 (IL-10), Interleukin-12 (IL-12), Interleukin-13 (IL-13), Interleukin-2 (IL-2), Interleukin-2 Receptor (IL-2R), Interleukin-4 (IL-4), Interleukin-5 (IL-5), Interleukin-6 (IL-6), Interleukin-8 (IL-8), Tumor Necrosis Factor alpha (TNF alpha).
URL: https://www.phenxtoolkit.org/index.php
cui: C0201576
CADSR CDE: 3151332
LOINC: 62867-7

Assay for Hepatitis B
type: Class
subclass of: Infectious Diseases and Immunity
definition: This is a bioassay to measure hepatitis B (HBV).
URL: https://www.phenxtoolkit.org/index.php
cui: C1287409
CADSR CDE: 2694945
LOINC: 62871-9

Assay for Hepatitis C
type: Class
subclass of: Infectious Diseases and Immunity
definition: This is a bioassay to detect antibody to hepatitis C virus (HCV).
URL: https://www.phenxtoolkit.org/index.php
cui: C1287411
CADSR CDE: 2695021
LOINC: 62869-3

Medical History
type: Class
subclass of: Infectious Diseases and Immunity
definition: This measure is a questionnaire to collect information on a respondent's medical history.
URL: https://www.phenxtoolkit.org/index.php
cui: C0262926
CADSR CDE: 2543596
LOINC: 62890-9

Conditions Relevant to Immune Response - Screener
type: Class
subclass of: Infectious Diseases and Immunity
definition: This is a questionnaire to screen for personal history of adverse events from vaccinations.
URL: https://www.phenxtoolkit.org/index.php
cui: C0301872
CADSR CDE: 3153141, 3153145
LOINC: 62879-2, 62880-0

Personal Medical History of Allergies, Infectious Diseases, and Immunizations
type: Class
subclass of: Infectious Diseases and Immunity
definition: This measure is a questionnaire to collect information on a participant's personal medical history of allergies, infectious diseases, and immunizations.
URL: https://www.phenxtoolkit.org/index.php
cui: C0947313
CADSR CDE: 3151223, 3151230, 3151231, 3151220, 3151221, 3151222
LOINC: 62894-1, 62895-8

Migraine
type: Class
subclass of: Neurology
definition: A questionnaire to assess migraines and headaches.
URL: https://www.phenxtoolkit.org/index.php
cui: C0018681
CADSR CDE: 3107301
LOINC: 62765-3

Autoimmune Diseases Related to Type 1 Diabetes
type: Class
subclass of: Diabetes
definition: A questionnaire to ascertain a study participant's history of autoimmune diseases.
URL: https://www.phenxtoolkit.org/index.php
cui: C0004364
CADSR CDE: 3065875
LOINC: 62789-3

Family History of Diabetes
type: Class
subclass of: Diabetes
definition: A questionnaire to determine the presence of diabetes among a study participant's first degree relatives.
URL: https://www.phenxtoolkit.org/index.php
cui: C0260526
CADSR CDE: 3067589
LOINC: 62791-9

Medication Inventory
type: Class
subclass of: Diabetes
definition: A questionnaire that captures the type and dosage of all prescription and over-the-counter medications as well as dietary supplements.
URL: https://www.phenxtoolkit.org/index.php
cui: C0240320
CADSR CDE: 3070662
LOINC: 62793-5

Diabetic Peripheral Neuropathy
type: Class
subclass of: Diabetes
definition: A questionnaire to determine if a respondent has a history of peripheral neuropathy.
URL: https://www.phenxtoolkit.org/index.php
cui: C0740447
CADSR CDE: 3070668
LOINC: 62795-0

Personal History of Type 1 and Type 2 Diabetes
type: Class
subclass of: Diabetes
definition: A questionnaire to determine a respondent's history of Type 1 and Type 2 diabetes.
URL: https://www.phenxtoolkit.org/index.php
cui: C0011849
CADSR CDE: 3070673
LOINC: 62797-6

Personal History of Kidney Failure
type: Class
subclass of: Diabetes
definition: A questionnaire to determine if the respondent has a history of kidney failure.
URL: https://www.phenxtoolkit.org/index.php
cui: C0035078
CADSR CDE: 3070678
LOINC: 62799-2

Diabetic Retinopathy
type: Class
subclass of: Diabetes
definition: A questionnaire to determine if a respondent has a history of retinopathy.
URL: https://www.phenxtoolkit.org/index.php
cui: C0011884
CADSR CDE: 3070684
LOINC: 62801-6

Fasting Plasma Glucose for Diabetes Screening
type: Class
subclass of: Diabetes
definition: A bioassay to determine the concentration of plasma glucose after a period of fasting.
URL: https://www.phenxtoolkit.org/index.php
cui: C0202042
CADSR CDE: 3070691, 3070691
LOINC: 62851-1, 62852-9

Glycosylated Hemoglobin Assay that Reflects Long-Term Glucose Concentration
type: Class
subclass of: Diabetes
definition: A bioassay to measure percent glycosylated hemoglobin (Glycohemoglobin, Hemoglobin A1C, A1C), or the amount of glucose attached to the hemoglobin in red blood cells (American Diabetes Association, 2009).
URL: https://www.phenxtoolkit.org/index.php
cui: C0019018
CADSR CDE: 3049798
LOINC: 62854-5

Substance Abuse and Dependence - Past Year
type: Class
subclass of: Assessment of Substance Use and Substance Use Disorders
definition: Interviewer-administered questions to determine whether the respondent has experienced symptoms of alcohol abuse and dependence, nicotine dependence, and/or substance abuse and dependence in the past year (i.e., past 12 months).
URL: https://www.phenxtoolkit.org/index.php
cui: C0681693
CADSR CDE: 3466867, 3466876, 3466871

Alcohol Breathalyzer
type: Class
subclass of: Assessment of Substance Use and Substance Use Disorders
definition: Bioassay used to detect and quantify recent alcohol use.
URL: https://www.phenxtoolkit.org/index.php
cui: C0085924
CADSR CDE: 3332422

On-site Urine Drug Screen
type: Class
subclass of: Assessment of Substance Use and Substance Use Disorders
definition: Bioassay used to detect recent illegal drug use.
URL: https://www.phenxtoolkit.org/index.php
cui: C0020896
CADSR CDE: 3332426

Lab-based Urine Drug Analysis
type: Class
subclass of: Assessment of Substance Use and Substance Use Disorders
definition: Bioassay used to detect and quantify recent illegal drug use.
URL: https://www.phenxtoolkit.org/index.php
cui: C0478670
CADSR CDE: 3332430

Acute Subjective Response to Substances - Current
type: Class
subclass of: Substance-specific Intermediate Phenotypes
definition: Instruments used separately to assess current acute subjective responses to substances that the respondent has recently ingested or used.
URL: https://www.phenxtoolkit.org/index.php
cui: C0683065
CADSR CDE: 3332435, 3332439, 3332446, 3332447

Acute Subjective Responses to Substances - Retrospective
type: Class
subclass of: Substance-specific Intermediate Phenotypes
definition: Instruments used separately to assess acute subjective response to substances in the past.
URL: https://www.phenxtoolkit.org/index.php
cui: C0683065
CADSR CDE: 3332451, 3332455

Self-reported Craving
type: Class
subclass of: Substance-specific Intermediate Phenotypes
definition: Instruments used separately to assess the severity of craving tobacco, alcohol, or illegal drugs, via self-report.
URL: https://www.phenxtoolkit.org/index.php
cui: C0678308
CADSR CDE: 3332459, 3332464, 3332469, 3332473, 3332477, 3332481

Expectancies - Alcohol, Tobacco, and Other Substances
type: Class
PARENT UMLS CUI: C0683044
subclass of: Substance-specific Intermediate Phenotypes
definition: Instruments used separately to assess expectations of the positive and negative effects of drinking alcohol, smoking cigarettes, using marijuana, using illegal stimulant drugs, or misusing prescription stimulant drugs.
URL: https://www.phenxtoolkit.org/index.php
cui: C0814092
CADSR CDE: 3332486, 3391983, 3391982, 3332497, 3332501

Response Inhibition (Go/NoGo Task)
type: Class
subclass of: Substance Use-related Neurobehavioral and Cognitive Risk Factors
definition: This measure assesses the ability of the participant to suppress prepotent or interfering impulses.
URL: https://www.phenxtoolkit.org/index.php
cui: C0021125
CADSR CDE: 3371888

Community Risk and Protective Factors
type: Class
subclass of: Substance Use-related Psychosocial Risk Factors
definition: This self-administered questionnaire assesses adolescents' reports about the level and prevalence of exposure to substance use risk and protective factors in the community.
URL: https://www.phenxtoolkit.org/index.php
cui: C0009462
CADSR CDE: 3371895

Externalizing Problems
type: Class
subclass of: Substance Use-related Psychosocial Risk Factors
definition: This measure assesses the participant's externalizing, or disruptive, behaviors.
URL: https://www.phenxtoolkit.org/index.php
cui: C0012734
CADSR CDE: 3371900

Family Risk and Protective Factors
type: Class
subclass of: Substance Use-related Psychosocial Risk Factors
definition: This measure assesses the level and prevalence of adolescents' exposure to substance use risk and protective factors in the family environment.
URL: https://www.phenxtoolkit.org/index.php
cui: C0680056
CADSR CDE: 3371929

Peer/Partner Substance Use and Tolerance of Substance Use
type: Class
PARENT UMLS CUI: C0562366
subclass of: Substance Use-related Psychosocial Risk Factors
definition: This measure assesses the perception (not actual use) of substance use by peers and tolerance of substance use.
URL: https://www.phenxtoolkit.org/index.php
cui: C0814568
CADSR CDE: 3371958

School Risk and Protective Factors
type: Class
subclass of: Substance Use-related Psychosocial Risk Factors
definition: This measure assesses the level and prevalence of adolescents' exposure to substance use risk and protective factors in the school environment, an adolescent's perceptions about the opportunities and rewards in school.
URL: https://www.phenxtoolkit.org/index.php
cui: C0036375
CADSR CDE: 3371936

Motives - Alcohol, Tobacco, and Other Substances
type: Class
subclass of: Substance-specific Intermediate Phenotypes
definition: Instruments used separately to assess the motives (reasons) for drinking alcohol, smoking cigarettes, or using drugs.
URL: https://www.phenxtoolkit.org/index.php
cui: C0678310
CADSR CDE: 3332520, 3332520, 3332524, 3332528

Cognitive Flexibility (Dimensional Change Card Sort)
type: Class
subclass of: Substance Use-related Neurobehavioral and Cognitive Risk Factors
definition: This measure assesses flexibility in detection and use of rules that govern behavior.
URL: https://www.phenxtoolkit.org/index.php
cui: C0009240
CADSR CDE: 3371717, 3371733

Decision Making (Iowa Gambling Task)
type: Class
PARENT UMLS CUI: C0009240,C0935584
subclass of: Substance Use-related Neurobehavioral and Cognitive Risk Factors
definition: This measure assesses the degree to which subjects can learn and adapt behavior to avoid punished responses in order to maximize benefits from a series of decisions.
URL: https://www.phenxtoolkit.org/index.php
cui: C0011109
CADSR CDE: 3346926, 3346876

Delayed Reward Discounting (Monetary Choice Questionnaire)
type: Class
subclass of: Substance Use-related Neurobehavioral and Cognitive Risk Factors
definition: This measure assesses whether the participant prefers smaller immediate rewards over delayed larger rewards.
URL: https://www.phenxtoolkit.org/index.php
cui: C0009240
CADSR CDE: 3346937

Inhibitory Control (Stop Signal Paradigm)
type: Class
subclass of: Substance Use-related Neurobehavioral and Cognitive Risk Factors
definition: This measure assesses the ability of the participant to inhibit a response that has already been initiated.
URL: https://www.phenxtoolkit.org/index.php
cui: C0021125
CADSR CDE: 3371867

Laboratory Test of Risk Taking (Balloon Analogue Risk Task)
type: Class
PARENT UMLS CUI: C0009240,C0935584
subclass of: Substance Use-related Neurobehavioral and Cognitive Risk Factors
definition: This measure assesses the participant's tolerance for exposure to risk in pursuit of a reward.
URL: https://www.phenxtoolkit.org/index.php
cui: C0086931
CADSR CDE: 3371873

Motor and Attentional Impulsivity (Immediate and Delayed Memory Task)
type: Class
subclass of: Substance Use-related Neurobehavioral and Cognitive Risk Factors
definition: This measure requires and assesses sustained attention; it also assesses motor impulsivity as responding before complete evaluation of the stimuli.
URL: https://www.phenxtoolkit.org/index.php
cui: C0004268
CADSR CDE: 3371884

Perceived Stress
type: Class
subclass of: Psychosocial
definition: This is a measure of the degree to which situations in one's life are appraised as stressful.
URL: https://www.phenxtoolkit.org/index.php
cui: C0038435
CADSR CDE: 2199495
LOINC: 64394-0

Chronic Stress
type: Class
subclass of: Psychosocial
definition: This measure is used to assess a person's perception of ongoing and enduring sources of stress in his/her life conditions.
URL: https://www.phenxtoolkit.org/index.php
cui: C0038435
CADSR CDE: 3162919
LOINC: 62942-8

Exposures to Violence
type: Class
PARENT UMLS CUI: C0042693
subclass of: Psychosocial
definition: This measure asks about the respondent's history of trauma and victimization events.
URL: https://www.phenxtoolkit.org/index.php
cui: C0814549
CADSR CDE: 3162928, 3162929
LOINC: 62944-4, 62945-1

Crime and Delinquency
type: Class
subclass of: Psychosocial
definition: This measure is a series of questions used to assess criminal and delinquent behavior.
URL: https://www.phenxtoolkit.org/index.php
cui: C0010325
CADSR CDE: 3162936
LOINC: 62939-4

Social Capital
type: Class
subclass of: Psychosocial
definition: This measure identifies a person's ability to connect to other types of individuals in life/society. Assessing a person's connectedness to others who hold specific resources (e.g., skills, knowledge, prestige, authority) is considered a standard way to measure the kind of social capital that individuals can access for routine and unusual circumstances/needs. The Position Generator identifies these social network resources, which are considered social capital.
URL: https://www.phenxtoolkit.org/index.php
cui: C1510639
CADSR CDE: 3162990
LOINC: 64396-5

Computed Tomography (CT) of the Abdominal Organs
type: Class
PARENT UMLS CUI: C0040405
subclass of: Gastrointestinal
definition: Computed tomography (CT) of the abdominal organs involves 3-D medical imaging of the abdominal region to determine anatomic features and correlates of digestive diseases and cancers.
URL: https://www.phenxtoolkit.org/index.php
cui: C0412620
CADSR CDE: 3163023
LOINC: 62961-8

Celiac Sprue Assay
type: Class
subclass of: Gastrointestinal
definition: This is a two-step serologic measure to determine whether a person is positive for celiac sprue, also known as gluten-sensitive enteropathy.
URL: https://www.phenxtoolkit.org/index.php
cui: C0007570
CADSR CDE: 3163027
LOINC: 62957-6

Colorectal Procedures and Outcomes (Medical Record Review)
type: Class
subclass of: Gastrointestinal
definition: This is a measure to obtain information about the colon and rectum—including colorectal malignancies, adenomas, and diagnostic and staging procedures—using medical records of retrospective procedures.
URL: https://www.phenxtoolkit.org/index.php
cui: C0555952
CADSR CDE: 3163031
LOINC: 62959-2

Emotional Distress
type: Class
subclass of: Gastrointestinal
definition: This is a measure to assess emotional distress in the past 7 days.
URL: https://www.phenxtoolkit.org/index.php
cui: C0700361
CADSR CDE: 3163035
LOINC: 62963-4

Assessment of Functional Gastrointestinal Disorders
type: Class
subclass of: Gastrointestinal
definition: Questionnaire that asks about gastrointestinal symptoms to help identify the presence of functional gastrointestinal disorders (FGIDs) and their subtypes.
URL: https://www.phenxtoolkit.org/index.php
cui: C0559031
CADSR CDE: 3163043, 3163044, 3163042
LOINC: 62951-9, 62952-7, 62953-5

Assessment of Gallbladder Disease and Related Conditions
type: Class
PARENT UMLS CUI: C0016976
subclass of: Gastrointestinal
definition: This measure assesses gallbladder disease and related conditions.
URL: https://www.phenxtoolkit.org/index.php
cui: C0016977
CADSR CDE: 3163048
LOINC: 62955-0

Gastroesophageal Reflux Disease (GERD) Symptoms
type: Class
subclass of: Gastrointestinal
definition: This questionnaire asks about symptoms of heartburn, pain, and regurgitation in the past 7 days to determine the presence of gastroesophageal reflux disease (GERD).
URL: https://www.phenxtoolkit.org/index.php
cui: C0017168
CADSR CDE: 3163052
LOINC: 62973-3

Health Impact of Inflammatory Bowel Disease
type: Class
subclass of: Gastrointestinal
definition: This measure obtains a clinical status in respondents who have been diagnosed with inflammatory bowel disease (IBD) (e.g., Crohn's disease and ulcerative colitis) using measures of health-related quality of life over the past 2 weeks.
URL: https://www.phenxtoolkit.org/index.php
cui: C0021390
CADSR CDE: 3163056
LOINC: 62965-9

Liver Function Assay
type: Class
PARENT UMLS CUI: C0023884
subclass of: Gastrointestinal
definition: This is a measure to assess liver functionality and cellular integrity.
URL: https://www.phenxtoolkit.org/index.php
cui: C0023901
CADSR CDE: 3163061
LOINC: 62967-5

Pain, Abdominal (Type and Intensity)
type: Class
subclass of: Gastrointestinal
definition: This is a measure to assess pain and related symptoms.
URL: https://www.phenxtoolkit.org/index.php
cui: C0000737
CADSR CDE: 3163065
LOINC: 62969-1

Personal History of Gastrointestinal Conditions
type: Class
subclass of: Gastrointestinal
definition: This is a measure to assess personal history of gastrointestinal conditions and procedures.
URL: https://www.phenxtoolkit.org/index.php
cui: C0521362
CADSR CDE: 3163069
LOINC: 62971-7

Physical, Social, and Mental Health Functioning (SF-36v2)
type: Class
subclass of: Gastrointestinal
definition: This is a measure to assess overall health status and outcomes.
URL: https://www.phenxtoolkit.org/index.php
cui: C1519136
CADSR CDE: 3163073
LOINC: 62975-8

Child-Reported Parental Education Attainment
type: Class
subclass of: Social Environments
definition: This measure is a questionnaire to identify a parent's highest level of education obtained.
URL: https://www.phenxtoolkit.org/index.php
cui: C0682174
CADSR CDE: 3139305
LOINC: 63013-7

Childhood Maltreatment
type: Class
PARENT UMLS CUI: C0814549,C0008060C0730557
subclass of: Social Environments
definition: This measure is a questionnaire to inquire about childhood abuse and neglect. The instrument includes several items that assess the minimization or denial of such experiences.
URL: https://www.phenxtoolkit.org/index.php
cui: C1395213
CADSR CDE: 3144950
LOINC: 63011-1

Discrimination
type: Class
subclass of: Social Environments
definition: This measure is a questionnaire to assess perceived discriminatory experiences.
URL: https://www.phenxtoolkit.org/index.php
cui: C0337458
CADSR CDE: 3144954
LOINC: 63015-2

Coping Styles
type: Class
PARENT UMLS CUI: C0009967
subclass of: Psychosocial
definition: This is a measure of coping styles that an individual might use in response to a recent problem or stressful situation.
URL: https://www.phenxtoolkit.org/index.php
cui: C0683252
CADSR CDE: 3163133, 3163134, 3163134
LOINC: 62915-4, 62916-2, 62916-2

Family Conflict
type: Class
PARENT UMLS CUI: C0680056,C0814549,C0730557
subclass of: Social Environments
definition: This measure is a questionnaire to assess the level of conflict in families and in intimate relationships.
URL: https://www.phenxtoolkit.org/index.php
cui: C0206072
CADSR CDE: 3144962, 3144958
LOINC: 63017-8, 63018-6

Family Control and Organization
type: Class
subclass of: Social Environments
definition: This measure is a questionnaire that assesses organization and structure in planning family activities and responsibilities.
URL: https://www.phenxtoolkit.org/index.php
cui: C0680056
CADSR CDE: 3144966
LOINC: 63020-2

Family Interpersonal Relationships
type: Class
subclass of: Social Environments
definition: This measure is a questionnaire to assess the quality of interpersonal relationships within a family.
URL: https://www.phenxtoolkit.org/index.php
cui: C0680056
CADSR CDE: 3144970
LOINC: 63022-8

Healthy Food Environments
type: Class
PARENT UMLS CUI: C0559578
subclass of: Social Environments
definition: This measure utilizes a questionnaire to assess a respondent's access to healthy foods and healthy eating alternatives in his or her local neighborhood.
URL: https://www.phenxtoolkit.org/index.php
cui: C0009462
CADSR CDE: 3144974
LOINC: 63024-4

Job Strain
type: Class
subclass of: Social Environments
definition: This measure is a questionnaire that assesses how much stress a person experiences in their job.
URL: https://www.phenxtoolkit.org/index.php
cui: C0344330
CADSR CDE: 3151140
LOINC: 63034-3

Neighborhood Collective Efficacy - Community Cohesion and Informal Social Control
type: Class
subclass of: Social Environments
definition: This measure is a questionnaire to assess the mutual trust and shared expectations among neighbors.
URL: https://www.phenxtoolkit.org/index.php
cui: C0009462
CADSR CDE: 3139335
LOINC: 63026-9

Neighborhood Concentrated Disadvantage
type: Class
subclass of: Social Environments
definition: This measure uses readily available secondary data from the U.S. Census Bureau.
URL: https://www.phenxtoolkit.org/index.php
cui: C0032854
CADSR CDE: 3150986
LOINC: 63036-8

Neighborhood Safety
type: Class
subclass of: Social Environments
definition: This measure is a questionnaire to assess the respondent's perceptions about safety and crime in their neighborhoods.
URL: https://www.phenxtoolkit.org/index.php
cui: C0680459
CADSR CDE: 3139339
LOINC: 63028-5

Race/Ethnic Residential Segregation
type: Class
subclass of: Social Environments
definition: A measure of neighborhood race/ethnic residential segregation, based on data from the U.S. Census Bureau.
URL: https://www.phenxtoolkit.org/index.php
cui: C0080141
CADSR CDE: 3151013
LOINC: 63038-4

School Social Environment
type: Class
PARENT UMLS CUI: C0036375
subclass of: Social Environments
definition: This measure is a questionnaire to assess an adolescent respondent's perceptions of the quality and character of his or her school social environment, which in educational literature most frequently is referenced as school climate.
URL: https://www.phenxtoolkit.org/index.php
cui: C0681381
CADSR CDE: 3139351
LOINC: 63030-1

Social Networks
type: Class
PARENT UMLS CUI: C0009462,C0027569
subclass of: Social Environments
definition: This measure is an interviewer-administered questionnaire to assess whom respondents depend on for help in important general matters and specific health matters.
URL: https://www.phenxtoolkit.org/index.php
cui: C0150775
CADSR CDE: 3139355
LOINC: 63032-7

Life Events
type: Class
subclass of: Social Environments
definition: This measure is a questionnaire to assess the respondent's exposure to a broad range of life events.
URL: https://www.phenxtoolkit.org/index.php
cui: C0557155
CADSR CDE: 3139329, 3139326
LOINC: 63040-0, 63041-8

Family History of Substance Use Problems
type: Class
subclass of: Assessment of Substance Use and Substance Use Disorders
definition: Instruments used separately to obtain family history of substance use problems including tobacco, alcohol, and other drugs.
URL: https://www.phenxtoolkit.org/index.php
cui: C1397159
CADSR CDE: 2958514, 2958515, 2958513

Screening and Severity of Substance Use Problems
type: Class
PARENT UMLS CUI: C0524395,C1563199,C0524394),C1828298
subclass of: Assessment of Substance Use and Substance Use Disorders
definition: Instruments used separately to screen for alcohol and other drug problems and to assess the severity of these problems.
URL: https://www.phenxtoolkit.org/index.php
cui: C0679810
CADSR CDE: 3332392, 3332396, 3332401, 3332406

Patterns of Substance Use
type: Class
subclass of: Assessment of Substance Use and Substance Use Disorders
definition: Instruments used separately to assess patterns of substance use in adolescents and adults.
URL: https://www.phenxtoolkit.org/index.php
cui: C0678269
CADSR CDE: 3332368, 3332364

Sensitivity to Reward and Punishment
type: Class
subclass of: Substance Use-related Psychosocial Risk Factors
definition: This measure assesses the participant's sensitivity to two motivational systems: the behavioral inhibition system (BIS) and the behavioral activation system (BAS).
URL: https://www.phenxtoolkit.org/index.php
cui: C0026605
CADSR CDE: 3372370, 3372041

Cigarette Price
type: Class
PARENT UMLS CUI: C0677453
subclass of: Substance Use-related Community Factors
definition: Instrument used to ask about the price paid the last time a respondent purchased cigarettes.
URL: https://www.phenxtoolkit.org/index.php
cui: C0680993
CADSR CDE: 3371997

Disapproval of Substance Use
type: Class
subclass of: Substance Use-related Community Factors
definition: Instrument used to gather information on whether respondents disapprove of other people using specific substances, including cigarettes, alcohol, and illegal drugs.
URL: https://www.phenxtoolkit.org/index.php
cui: C0679130
CADSR CDE: 3372033

Perceived Availability of Illegal Drugs and Alcohol
type: Class
subclass of: Substance Use-related Community Factors
definition: Instrument used to gather respondents' perceptions of the availability of substances including illegal drugs and alcohol.
URL: https://www.phenxtoolkit.org/index.php
cui: C0680985
CADSR CDE: 3373247

Perceived Harm of Substance Use
type: Class
subclass of: Substance Use-related Community Factors
definition: Instrument used to gather respondents' perceptions on how much they think people risk harming themselves physically and in other ways when using certain drugs and other substances, including cigarettes, alcohol, marijuana, LSD, heroin, and cocaine.
URL: https://www.phenxtoolkit.org/index.php
cui: C0679130
CADSR CDE: 3373287

Treatment Availability and Level of Care
type: Class
subclass of: Substance Use-related Community Factors
definition: A measure of the alcohol and drug abuse treatment admissions and level of care capacity available in a specific community, at the census tract level.
URL: https://www.phenxtoolkit.org/index.php
cui: C0814470
CADSR CDE: 3373294

Substance Abuse Treatment Quality
type: Class
subclass of: Substance Use-related Community Factors
definition: A measure of the quality of treatment services, based on data from the Healthcare Effectiveness Data and Information Set (HEDIS).
URL: https://www.phenxtoolkit.org/index.php
cui: C0814470
CADSR CDE: 3373326

Unmet Need for Alcohol or Drug Treatment
type: Class
subclass of: Substance Use-related Community Factors
definition: A measure of the treatment needs, service utilizations, and barriers of alcohol and drug treatment, based on data from the National Survey on Drug Use and Health (NSDUH).
URL: https://www.phenxtoolkit.org/index.php
cui: C0814470
CADSR CDE: 3373355

Point of Sale Environment for Alcohol and Tobacco
type: Class
subclass of: Substance Use-related Community Factors
definition: Instrument used to assess the point-of-sale environment, including availability, advertising, pricing, and promotion of alcoholic beverages and tobacco products in retail stores.
URL: https://www.phenxtoolkit.org/index.php
cui: C0680985
CADSR CDE: 3373480, 3373483

Behavioral Health Screener
type: Class
subclass of: Substance Use-related Co-morbidities and Health-related Outcomes
definition: An instrument used to identify behavioral health disorders, such as internalizing psychiatric disorders, externalizing psychiatric disorders, substance use disorders, and crime and violence problems.
URL: https://www.phenxtoolkit.org/index.php
cui: C0012734
CADSR CDE: 3373507

Comprehensive HIV Risk Assessment
type: Class
subclass of: Substance Use-related Co-morbidities and Health-related Outcomes
definition: Instrument used to collect information on a respondent's HIV risk behavior, including sexual behavior, HIV drug use risk behavior, and HIV testing and care experiences.
URL: https://www.phenxtoolkit.org/index.php
cui: C1537021
CADSR CDE: 3373513

Duration of Abstinence
type: Class
subclass of: Substance Use-related Co-morbidities and Health-related Outcomes
definition: Question asking respondents about the most recent time they consumed alcohol or substances.
URL: https://www.phenxtoolkit.org/index.php
cui: C0678273
CADSR CDE: 3373522, 3373525

Health Quality Index for Economic Evaluations
type: Class
subclass of: Substance Use-related Co-morbidities and Health-related Outcomes
definition: Instrument used to measure respondent's quality of life, given medical conditions or health problems.
URL: https://www.phenxtoolkit.org/index.php
cui: C0034380
CADSR CDE: 3373530, 3373557

Substance Abuse Treatment, Participation, and Involvement
type: Class
subclass of: Substance Use-related Co-morbidities and Health-related Outcomes
definition: An instrument that measures substance use treatment during the past 90 days, participants' attitudes about their progress in treatment, and aspects of participants' cognitive and behavioral involvement in treatment.
URL: https://www.phenxtoolkit.org/index.php
cui: C0814470
CADSR CDE: 3374406

Self-Help Involvement
type: Class
subclass of: Substance Use-related Co-morbidities and Health-related Outcomes
definition: A scale based on the days of self-help meetings attended, behaviors associated with engaging in self-help, and whether the person is "affiliated" with one or more self-help groups.
URL: https://www.phenxtoolkit.org/index.php
cui: C0597431
CADSR CDE: 3375226

Service Utilization and Cost
type: Class
subclass of: Substance Use-related Co-morbidities and Health-related Outcomes
definition: This measure takes the days/times in the past 90 days of self-reported service utilization variables related to health care, mental health care, and school and justice system involvement and multiplies them by a unit price of those services. These costs are then summed to get a quarterly burden of substance use for a study sample or can be used to demonstrate gains in these domains associated with treatment/recovery.
URL: https://www.phenxtoolkit.org/index.php
cui: C0018748
CADSR CDE: 3376110

Victimization Screener
type: Class
PARENT UMLS CUI: C0042693,C0814549
subclass of: Substance Use-related Co-morbidities and Health-related Outcomes
definition: A screener to gather information on the types of victimization a respondent has experienced in his or her lifetime.
URL: https://www.phenxtoolkit.org/index.php
cui: C2711168
CADSR CDE: 3376115

Body Mass Index
type: Class
subclass of: Substance Abuse and Addiction Core: Tier 1
definition: Body mass index (BMI) is derived from height and weight measurements. Height is the distance from the top of the participant's head to the heels of his or her feet (i.e., the vertical length). Current measured weight is the weight in kilograms or pounds of the participant. BMI is calculated through a formula in which weight is divided by height squared.
URL: https://www.phenxtoolkit.org/index.php
cui: C0005893
CADSR CDE: 2006410

Self-report of Human Immunodeficiency Virus (HIV) Testing
type: Class
subclass of: Substance Abuse and Addiction Core: Tier 1
definition: Instrument used to collect information on whether a respondent has been tested for Human Immunodeficiency Virus (HIV); the results of the testing; and, if not tested, the reasons for not being tested.
URL: https://www.phenxtoolkit.org/index.php
cui: C1537021
CADSR CDE: 3371698

Internalizing, Externalizing, and Substance Use Disorders Screener
type: Class
subclass of: Substance Abuse and Addiction Core: Tier 2
definition: An instrument used to identify behavioral health disorders, including internalizing psychiatric disorders, externalizing psychiatric disorders, and substance use disorders.
URL: https://www.phenxtoolkit.org/index.php
cui: C0012734
CADSR CDE: 3371703