phenotypic sex
type: Class
subclass of: biological sex

ntdo resource:arc7f55b6
type: Restriction
on property: hasInstant
on class: RightTimeBoundary
qualified cardinality: 1

ntdo resource:arc7f55b14
type: Restriction
on property: projectsTo
on class: Chronoid
qualified cardinality: 1

biological sex
type: Class
subclass of: organismal quality
definition: An organismal quality inhering in a bearer by virtue of the bearer's ability to undergo sexual reproduction in order to differentiate the individuals or types involved.

organismal quality
type: Class
subclass of: ObjectQuality
definition: A quality that inheres in an entire organism or part of an organism.

female quality
type: Class
subclass of: phenotypic sex
disjoint with: male quality
comment: The "quality" term was added to the label in NTDO for a better reading.
definition: A biological sex quality inhering in an individual or a population that only produces gametes that can be fertilised by male gametes.

male quality
type: Class
subclass of: phenotypic sex
comment: The "quality" term was added to the label in NTDO for a better reading.
definition: A biological sex quality inhering in an individual or a population whose sex organs contain only male gametes.

ntdo resource:arc7f55b24
type: Restriction
on property: projectsTo
on class: Chronoid
qualified cardinality: 1

health surveillance notification action
type: Class
equivalent class: ntdo resource:arc7f55b40
subclass of: Action
subclass of: ntdo resource:arc7f55b49

organism characteristic value region
type: Class
subclass of: ValueRegion
definition: An abstract region in which organismal value characteristics are located.
publisher: NTDO

phenotypic sex value region
type: Class
subclass of: organism characteristic value region

Leishmaniose cutâneo-mucosa
comment: B55.2 Leishmaniose cutaneo-mucosa

Leishmaniose visceral
comment: B55.0 Leishmaniose visceral

Leishmaniose cutânea
comment: B55.1 Leishmaniose cutanea