LiPro class contains lipid
type: ObjectProperty
inverse of: lipid has LiPro class
sub property of: topObjectProperty

lipid has LiPro class
type: ObjectProperty
sub property of: topObjectProperty

LiPro lipid class
type: Class
subclass of: LipidClass
comment: Instances of this class are lipid classes in the LiPro ontology.