lsr:fao
type: Ontology
obo vocabulary:format-version: 1.2
obo vocabulary:date: 31:01:2014 05:42
obo vocabulary:saved-by: dinglis
auto generated by [obo_vocabulary:auto-generated-by]: OBO-Edit 2.1-beta1
obo vocabulary:default-namespace: fungal_anatomy_ontology
namespace id rule [obo_vocabulary:namespace-id-rule]: * FAO:$sequence(7,0000001,9999999)$
obo vocabulary:remark: version: $Revision: 1.7 $

auto generated by [obo_vocabulary:auto-generated-by]
bio2rdf vocabulary:namespace: obo_vocabulary
bio2rdf vocabulary:identifier: auto-generated-by
type: obo vocabulary:Resource
in dataset: bioportal resource:bio2rdf.dataset.bioportal.R3
title: auto generated by
type: DatatypeProperty

namespace id rule [obo_vocabulary:namespace-id-rule]
bio2rdf vocabulary:namespace: obo_vocabulary
bio2rdf vocabulary:identifier: namespace-id-rule
type: obo vocabulary:Resource
in dataset: bioportal resource:bio2rdf.dataset.bioportal.R3
title: namespace id rule
type: DatatypeProperty

fungal structure [fao:0000001]
bio2rdf vocabulary:namespace: fao
bio2rdf vocabulary:identifier: 0000001
type: fao resource [fao_vocabulary:Resource]
in dataset: bioportal resource:bio2rdf.dataset.bioportal.R3
title: fungal structure
type: Class
obo vocabulary:related synonym: fungal structure ontology
subclass of: obo vocabulary:Entity

composite structure [fao:0000002]
bio2rdf vocabulary:namespace: fao
bio2rdf vocabulary:identifier: 0000002
type: fao resource [fao_vocabulary:Resource]
in dataset: bioportal resource:bio2rdf.dataset.bioportal.R3
title: composite structure
type: Class
description: A multicellular formation composed of cells from more than one species. [FAO:curators, SGD:clt]
obo vocabulary:related synonym: multispecific structure
subclass of: fungal structure [fao:0000001]

basidium [fao:0000003]
bio2rdf vocabulary:namespace: fao
bio2rdf vocabulary:identifier: 0000003
type: fao resource [fao_vocabulary:Resource]
in dataset: bioportal resource:bio2rdf.dataset.bioportal.R3
title: basidium
type: Class
description: A structure directly from which spores are formed following sexual reproduction in a Basidiomycete. [FAO:curators, ISBN:0471940526]
subclass of: sporangium [fao:0000052]
part_of [obo_vocabulary:part_of]: basidiocarp [fao:0000012]

sporangium [fao:0000052]
bio2rdf vocabulary:namespace: fao
bio2rdf vocabulary:identifier: 0000052
type: fao resource [fao_vocabulary:Resource]
in dataset: bioportal resource:bio2rdf.dataset.bioportal.R3
title: sporangium
type: Class
description: A structure within which spores develop. [FAO:curators]
x go [obo_vocabulary:x-go]: go:0043582
subclass of: sporophore [fao:0000010]
created_by [obo_vocabulary:created_by]: Maria
creation_date [obo_vocabulary:creation_date]: 2011-06-10T12:06:16Z

part_of [obo_vocabulary:part_of]
bio2rdf vocabulary:namespace: obo_vocabulary
bio2rdf vocabulary:identifier: part_of
type: obo vocabulary:Resource
in dataset: bioportal resource:bio2rdf.dataset.bioportal.R3
title: part_of
type: ObjectProperty

basidiocarp [fao:0000012]
bio2rdf vocabulary:namespace: fao
bio2rdf vocabulary:identifier: 0000012
type: fao resource [fao_vocabulary:Resource]
in dataset: bioportal resource:bio2rdf.dataset.bioportal.R3
title: basidiocarp
type: Class
description: A structure at the surface of which, or within, basidia and basidiospores develop in Basidiomycetes; site of karyogamy and meiosis. [ISBN:0471940526]
obo vocabulary:related synonym: mushroom
subclass of: fruitbody [fao:0000007]

ascocarp-bound ascus [fao:0000004]
bio2rdf vocabulary:namespace: fao
bio2rdf vocabulary:identifier: 0000004
type: fao resource [fao_vocabulary:Resource]
in dataset: bioportal resource:bio2rdf.dataset.bioportal.R3
title: ascocarp-bound ascus
type: Class
description: An ascus that is associated with an ascocarp. [FAO:curators]
subclass of: ascus [fao:0000014]
part_of [obo_vocabulary:part_of]: ascocarp [fao:0000008]

ascus [fao:0000014]
bio2rdf vocabulary:namespace: fao
bio2rdf vocabulary:identifier: 0000014
type: fao resource [fao_vocabulary:Resource]
in dataset: bioportal resource:bio2rdf.dataset.bioportal.R3
title: ascus
type: Class
description: A sac-like structure containing sexual spores formed by Ascomycotina; mature asci may have little or no cytoplasm or cytoplasmic contents, and no nucleus outside of the spores. [SGD:clt]
subclass of: sporangium [fao:0000052]

ascocarp [fao:0000008]
bio2rdf vocabulary:namespace: fao
bio2rdf vocabulary:identifier: 0000008
type: fao resource [fao_vocabulary:Resource]
in dataset: bioportal resource:bio2rdf.dataset.bioportal.R3
title: ascocarp
type: Class
description: A structure within which or at the surface of, an ascus develops in Ascomycetes. [ISBN:0471940526]
subclass of: fruitbody [fao:0000007]

obsolete [fao:0000005]
bio2rdf vocabulary:namespace: fao
bio2rdf vocabulary:identifier: 0000005
type: fao resource [fao_vocabulary:Resource]
in dataset: bioportal resource:bio2rdf.dataset.bioportal.R3
title: obsolete
type: Class
description: The placeholder class 'obsolete' has been made obsolete, as this is not tracked with an explicit obsoletion flag in obo format. [FAO:curators]
type: DeprecatedClass
subclass of: DeprecatedClass

stipe [fao:0000006]
bio2rdf vocabulary:namespace: fao
bio2rdf vocabulary:identifier: 0000006
type: fao resource [fao_vocabulary:Resource]
in dataset: bioportal resource:bio2rdf.dataset.bioportal.R3
title: stipe
type: Class
description: A stalk or stem; composed of hyphae arrayed parallel to the long axis of the structure; a stipe may be a single supporting hypha. [ISBN:0471940526, SGD:clt]
obo vocabulary:related synonym: stem
part_of [obo_vocabulary:part_of]: basidiocarp [fao:0000012]
subclass of: obo vocabulary:Entity

fruitbody [fao:0000007]
bio2rdf vocabulary:namespace: fao
bio2rdf vocabulary:identifier: 0000007
type: fao resource [fao_vocabulary:Resource]
in dataset: bioportal resource:bio2rdf.dataset.bioportal.R3
title: fruitbody
type: Class
description: Any specialized structure which bears or contains sexually or asexually derived spores. [FAO:curators, SGD:clt]
obo vocabulary:related synonym: fruiting body
subclass of: fungal structure [fao:0000001]

pileus [fao:0000009]
bio2rdf vocabulary:namespace: fao
bio2rdf vocabulary:identifier: 0000009
type: fao resource [fao_vocabulary:Resource]
in dataset: bioportal resource:bio2rdf.dataset.bioportal.R3
title: pileus
type: Class
description: The structure on which the spore-bearing tissue is carried in sexually-derived fruiting bodies. [ISBN:0471940526]
obo vocabulary:related synonym: cap
part_of [obo_vocabulary:part_of]: basidiocarp [fao:0000012]
subclass of: obo vocabulary:Entity

sporophore [fao:0000010]
bio2rdf vocabulary:namespace: fao
bio2rdf vocabulary:identifier: 0000010
type: fao resource [fao_vocabulary:Resource]
in dataset: bioportal resource:bio2rdf.dataset.bioportal.R3
title: sporophore
type: Class
description: A structure directly within which spores are contained or from which spores are formed. [FAO:curators]
obo vocabulary:related synonym: spore-bearing organ
x go [obo_vocabulary:x-go]: go:0075259
subclass of: fungal structure [fao:0000001]

x go [obo_vocabulary:x-go]
bio2rdf vocabulary:namespace: obo_vocabulary
bio2rdf vocabulary:identifier: x-go
type: obo vocabulary:Resource
in dataset: bioportal resource:bio2rdf.dataset.bioportal.R3
title: x go
type: ObjectProperty

go:0075259
bio2rdf vocabulary:namespace: go
bio2rdf vocabulary:identifier: 0075259
bio2rdf vocabulary:x-identifiers.org: http://identifiers.org/go/0075259
type: go resource [go_vocabulary:Resource]
in dataset: bioportal resource:bio2rdf.dataset.bioportal.R3

mycelium [fao:0000011]
bio2rdf vocabulary:namespace: fao
bio2rdf vocabulary:identifier: 0000011
type: fao resource [fao_vocabulary:Resource]
in dataset: bioportal resource:bio2rdf.dataset.bioportal.R3
title: mycelium
type: Class
description: A group or mass of discrete hyphae; the vegetative structure of many fungi. [ISBN:0471940526]
subclass of: fungal structure [fao:0000001]

ascospore in ascocarp-bound ascus [fao:0000013]
bio2rdf vocabulary:namespace: fao
bio2rdf vocabulary:identifier: 0000013
type: fao resource [fao_vocabulary:Resource]
in dataset: bioportal resource:bio2rdf.dataset.bioportal.R3
title: ascospore in ascocarp-bound ascus
type: Class
description: A thick walled spore that stores and protects one or more nuclei following sexual reproduction in an Ascomycete that is contained in an ascus associated with an ascocarp. [FAO:curators]
subclass of: ascospore [fao:0000020]
part_of [obo_vocabulary:part_of]: ascocarp-bound ascus [fao:0000004]

ascospore [fao:0000020]
bio2rdf vocabulary:namespace: fao
bio2rdf vocabulary:identifier: 0000020
type: fao resource [fao_vocabulary:Resource]
in dataset: bioportal resource:bio2rdf.dataset.bioportal.R3
title: ascospore
type: Class
description: A thick walled spore that stores and protects one or more nuclei following sexual reproduction in an Ascomycete. [SGD:clt]
subclass of: sexual spore [fao:0000017]

free ascus [fao:0000015]
bio2rdf vocabulary:namespace: fao
bio2rdf vocabulary:identifier: 0000015
type: fao resource [fao_vocabulary:Resource]
in dataset: bioportal resource:bio2rdf.dataset.bioportal.R3
title: free ascus
type: Class
description: An ascus that is not associated with an ascocarp and is usually derived from a single cell. [FAO:curators]
subclass of: ascus [fao:0000014]

ascospore in free ascus [fao:0000016]
bio2rdf vocabulary:namespace: fao
bio2rdf vocabulary:identifier: 0000016
type: fao resource [fao_vocabulary:Resource]
in dataset: bioportal resource:bio2rdf.dataset.bioportal.R3
title: ascospore in free ascus
type: Class
description: A thick walled spore that stores and protects one or more nuclei following sexual reproduction in an Ascomycete that is contained in an ascus not associated with an ascocarp. [FAO:curators]
subclass of: ascospore [fao:0000020]
part_of [obo_vocabulary:part_of]: free ascus [fao:0000015]

sexual spore [fao:0000017]
bio2rdf vocabulary:namespace: fao
bio2rdf vocabulary:identifier: 0000017
type: fao resource [fao_vocabulary:Resource]
in dataset: bioportal resource:bio2rdf.dataset.bioportal.R3
title: sexual spore
type: Class
description: A spore formed following meiosis. Sometimes following meiosis, prospores may undergo one or more rounds of mitosis before they are fully mature. [SGD:clt]
obo vocabulary:related synonym: meiotically-derived spore
subclass of: spore [fao:0000019]

spore [fao:0000019]
bio2rdf vocabulary:namespace: fao
bio2rdf vocabulary:identifier: 0000019
type: fao resource [fao_vocabulary:Resource]
in dataset: bioportal resource:bio2rdf.dataset.bioportal.R3
title: spore
type: Class
description: A differentiated form of an organism produced during or as a result of an asexual or sexual reproductive process; usually a cell with a thick cell wall that stores and protects one or more nuclei. Spores may be produced in response to, and are characteristically resistant to, adverse environmental conditions. [ISBN:0471940526]
subclass of: unicellular structure [fao:0000018]

unicellular structure [fao:0000018]
bio2rdf vocabulary:namespace: fao
bio2rdf vocabulary:identifier: 0000018
type: fao resource [fao_vocabulary:Resource]
in dataset: bioportal resource:bio2rdf.dataset.bioportal.R3
title: unicellular structure
type: Class
description: An individual cell composed of a plasma membrane, contents internal to the plasma membrane, and any external protective or encapsulating structure. [FAO:curators, SGD:clt]
obo vocabulary:exact synonym: cell
subclass of: fungal structure [fao:0000001]

basidiospore [fao:0000021]
bio2rdf vocabulary:namespace: fao
bio2rdf vocabulary:identifier: 0000021
type: fao resource [fao_vocabulary:Resource]
in dataset: bioportal resource:bio2rdf.dataset.bioportal.R3
title: basidiospore
type: Class
description: A thick walled spore that stores and protects one or more nuclei following sexual reproduction in an Basidiomycete; formed externally on extrusions of the basidium. [ISBN:0471940526, SGD:clt]
subclass of: sexual spore [fao:0000017]
part_of [obo_vocabulary:part_of]: basidium [fao:0000003]

teliospore [fao:0000022]
bio2rdf vocabulary:namespace: fao
bio2rdf vocabulary:identifier: 0000022
type: fao resource [fao_vocabulary:Resource]
in dataset: bioportal resource:bio2rdf.dataset.bioportal.R3
title: teliospore
type: Class
description: A spore with a very thick cell wall and extracellular peptidoglycan spikes that stores and protects one or more nuclei during dormancy in a Basidiomycete. [SGD:clt]
subclass of: basidiospore [fao:0000021]

asexual spore [fao:0000023]
bio2rdf vocabulary:namespace: fao
bio2rdf vocabulary:identifier: 0000023
type: fao resource [fao_vocabulary:Resource]
in dataset: bioportal resource:bio2rdf.dataset.bioportal.R3
title: asexual spore
type: Class
description: A spore formed following mitosis or mitoses. [PMID:2524423, PMID:9529886, SGD:clt]
obo vocabulary:related synonym: mitotically-derived spore
subclass of: spore [fao:0000019]

conidium [fao:0000024]
bio2rdf vocabulary:namespace: fao
bio2rdf vocabulary:identifier: 0000024
type: fao resource [fao_vocabulary:Resource]
in dataset: bioportal resource:bio2rdf.dataset.bioportal.R3
title: conidium
type: Class
description: An asexual, nonmotile spore formed by higher fungi; conidia are usually made from the side or tip of specialized sporogenous cells and do not form by progressive cleavage of the cytoplasm. [PMID:2524423, PMID:9529886, SGD:clt]
subclass of: asexual spore [fao:0000023]

uninucleate conidium [fao:0000025]
bio2rdf vocabulary:namespace: fao
bio2rdf vocabulary:identifier: 0000025
type: fao resource [fao_vocabulary:Resource]
in dataset: bioportal resource:bio2rdf.dataset.bioportal.R3
title: uninucleate conidium
type: Class
description: A conidium that has only one nucleus. [SGD:clt]
subclass of: conidium [fao:0000024]

uredospore [fao:0000026]
bio2rdf vocabulary:namespace: fao
bio2rdf vocabulary:identifier: 0000026
type: fao resource [fao_vocabulary:Resource]
in dataset: bioportal resource:bio2rdf.dataset.bioportal.R3
title: uredospore
type: Class
description: A thick walled spore that stores and protects one or more nuclei during dispersal following reproduction in an Basidiomycete. [SGD:clt]
obo vocabulary:related synonym: urediniospore
obo vocabulary:related synonym: urediospore
subclass of: basidiospore [fao:0000021]

conidium of conidiophore head [fao:0000027]
bio2rdf vocabulary:namespace: fao
bio2rdf vocabulary:identifier: 0000027
type: fao resource [fao_vocabulary:Resource]
in dataset: bioportal resource:bio2rdf.dataset.bioportal.R3
title: conidium of conidiophore head
type: Class
description: A uninucleate spore formed on specialized cells or projections, sterigma, of a conidiophore head. [PMID:9529886, SGD:clt]
subclass of: uninucleate conidium [fao:0000025]

microconidium [fao:0000028]
bio2rdf vocabulary:namespace: fao
bio2rdf vocabulary:identifier: 0000028
type: fao resource [fao_vocabulary:Resource]
in dataset: bioportal resource:bio2rdf.dataset.bioportal.R3
title: microconidium
type: Class
description: The smaller of two types of asexual spores formed by some fungi. An ovoid to pear-shaped asexual spore that contains very little cytoplasm and organelles, is uninucleate, and forms in vegetative hypae within a mycelium. Micronidia are extruded from the hyphal cell wall. [ISBN:0471940526, PMID:8357339, SGD:clt]
subclass of: uninucleate conidium [fao:0000025]

uninucleate macroconidium [fao:0000029]
bio2rdf vocabulary:namespace: fao
bio2rdf vocabulary:identifier: 0000029
type: fao resource [fao_vocabulary:Resource]
in dataset: bioportal resource:bio2rdf.dataset.bioportal.R3
title: uninucleate macroconidium
type: Class
description: A macroconidium that has only one nucleus. [SGD:clt]
subclass of: uninucleate conidium [fao:0000025]
subclass of: macroconidium [fao:0000038]

macroconidium [fao:0000038]
bio2rdf vocabulary:namespace: fao
bio2rdf vocabulary:identifier: 0000038
type: fao resource [fao_vocabulary:Resource]
in dataset: bioportal resource:bio2rdf.dataset.bioportal.R3
title: macroconidium
type: Class
description: The larger of two types of asexual spores formed by some fungi; usually round or oblong. [ISBN:0471940526, SGD:clt]
subclass of: conidium [fao:0000024]

uninucleate blastoconidium [fao:0000030]
bio2rdf vocabulary:namespace: fao
bio2rdf vocabulary:identifier: 0000030
type: fao resource [fao_vocabulary:Resource]
in dataset: bioportal resource:bio2rdf.dataset.bioportal.R3
title: uninucleate blastoconidium
type: Class
description: A blastoconidium that has only one nucleus. [SGD:clt]
subclass of: uninucleate macroconidium [fao:0000029]
subclass of: blastoconidium [fao:0000042]

blastoconidium [fao:0000042]
bio2rdf vocabulary:namespace: fao
bio2rdf vocabulary:identifier: 0000042
type: fao resource [fao_vocabulary:Resource]
in dataset: bioportal resource:bio2rdf.dataset.bioportal.R3
title: blastoconidium
type: Class
description: An oblong or round asexual reproductive spore formed specifically by budding. [CGD:doi, PMID:2524423, SGD:clt]
obo vocabulary:related synonym: blastospore
obo vocabulary:related synonym: reproductive blastospore
x go [obo_vocabulary:x-go]: go:0034299
subclass of: macroconidium [fao:0000038]

uninucleate arthroconidium [fao:0000031]
bio2rdf vocabulary:namespace: fao
bio2rdf vocabulary:identifier: 0000031
type: fao resource [fao_vocabulary:Resource]
in dataset: bioportal resource:bio2rdf.dataset.bioportal.R3
title: uninucleate arthroconidium
type: Class
description: An arthroconidium that has only one nucleus. [SGD:clt]
subclass of: uninucleate macroconidium [fao:0000029]
subclass of: arthroconidium [fao:0000041]

arthroconidium [fao:0000041]
bio2rdf vocabulary:namespace: fao
bio2rdf vocabulary:identifier: 0000041
type: fao resource [fao_vocabulary:Resource]
in dataset: bioportal resource:bio2rdf.dataset.bioportal.R3
title: arthroconidium
type: Class
description: Cylindrical spore formed by development and compartmentation of hyphae; the hyphae are often supporting blastoconidiophores. [PMID:2524423, SGD:clt]
obo vocabulary:related synonym: arthrospore
subclass of: macroconidium [fao:0000038]

vegetative cell [fao:0000032]
bio2rdf vocabulary:namespace: fao
bio2rdf vocabulary:identifier: 0000032
type: fao resource [fao_vocabulary:Resource]
in dataset: bioportal resource:bio2rdf.dataset.bioportal.R3
title: vegetative cell
type: Class
description: A single cell where nutrition and growth predominate, as opposed to cells that are undergoing sexual processes. [ISBN:0471940526, SGD:clt]
obo vocabulary:related synonym: yeast-form
subclass of: unicellular structure [fao:0000018]

multinucleate conidium [fao:0000033]
bio2rdf vocabulary:namespace: fao
bio2rdf vocabulary:identifier: 0000033
type: fao resource [fao_vocabulary:Resource]
in dataset: bioportal resource:bio2rdf.dataset.bioportal.R3
title: multinucleate conidium
type: Class
description: A conidium that has more than one nucleus. [SGD:clt]
subclass of: conidium [fao:0000024]

lichen thallus [fao:0000034]
bio2rdf vocabulary:namespace: fao
bio2rdf vocabulary:identifier: 0000034
type: fao resource [fao_vocabulary:Resource]
in dataset: bioportal resource:bio2rdf.dataset.bioportal.R3
title: lichen thallus
type: Class
description: A multicellular structure composed of multiple species; minimally composed of an alga or cyanobacterium and a fungus. [ISBN:0471940526, SGD:clt]
subclass of: composite structure [fao:0000002]

multinucleate macroconidium [fao:0000035]
bio2rdf vocabulary:namespace: fao
bio2rdf vocabulary:identifier: 0000035
type: fao resource [fao_vocabulary:Resource]
in dataset: bioportal resource:bio2rdf.dataset.bioportal.R3
title: multinucleate macroconidium
type: Class
description: A macroconidium that has more than one nucleus. [SGD:clt]
subclass of: multinucleate conidium [fao:0000033]
subclass of: macroconidium [fao:0000038]

multinucleate blastoconidium [fao:0000036]
bio2rdf vocabulary:namespace: fao
bio2rdf vocabulary:identifier: 0000036
type: fao resource [fao_vocabulary:Resource]
in dataset: bioportal resource:bio2rdf.dataset.bioportal.R3
title: multinucleate blastoconidium
type: Class
description: A blastoconidium that has more than one nucleus. [SGD:clt]
subclass of: multinucleate macroconidium [fao:0000035]
subclass of: blastoconidium [fao:0000042]

multinucleate arthroconidium [fao:0000037]
bio2rdf vocabulary:namespace: fao
bio2rdf vocabulary:identifier: 0000037
type: fao resource [fao_vocabulary:Resource]
in dataset: bioportal resource:bio2rdf.dataset.bioportal.R3
title: multinucleate arthroconidium
type: Class
description: An arthroconidium that has more than one nucleus. [SGD:clt]
subclass of: multinucleate macroconidium [fao:0000035]
subclass of: arthroconidium [fao:0000041]

oospore [fao:0000039]
bio2rdf vocabulary:namespace: fao
bio2rdf vocabulary:identifier: 0000039
type: fao resource [fao_vocabulary:Resource]
in dataset: bioportal resource:bio2rdf.dataset.bioportal.R3
title: oospore
type: Class
description: An asexual spore formed by Oomycetes; formed upon fertilization of an oosphere. [ISBN:0851988857, SGD:clt]
subclass of: asexual spore [fao:0000023]

zygospore [fao:0000040]
bio2rdf vocabulary:namespace: fao
bio2rdf vocabulary:identifier: 0000040
type: fao resource [fao_vocabulary:Resource]
in dataset: bioportal resource:bio2rdf.dataset.bioportal.R3
title: zygospore
type: Class
description: A thick walled, sexual, resting spore formed by Zygomycetes; sometimes refers to the spore and the multi-layered cell wall that encloses the spore, the zygosporangium. [ISBN:0471940526, SGD:clt]
subclass of: sexual spore [fao:0000017]

go:0034299
bio2rdf vocabulary:namespace: go
bio2rdf vocabulary:identifier: 0034299
bio2rdf vocabulary:x-identifiers.org: http://identifiers.org/go/0034299
type: go resource [go_vocabulary:Resource]
in dataset: bioportal resource:bio2rdf.dataset.bioportal.R3

conidiophore [fao:0000043]
bio2rdf vocabulary:namespace: fao
bio2rdf vocabulary:identifier: 0000043
type: fao resource [fao_vocabulary:Resource]
in dataset: bioportal resource:bio2rdf.dataset.bioportal.R3
title: conidiophore
type: Class
description: A specialized hypha, often aerial, that gives rise to asexual spores, known as conidia. [AspGD:mcc, ISBN:0471522295, PMID:9529886]
develops_from [obo_vocabulary:develops_from]: hypha [fao:0001001]
subclass of: obo vocabulary:Entity

develops_from [obo_vocabulary:develops_from]
bio2rdf vocabulary:namespace: obo_vocabulary
bio2rdf vocabulary:identifier: develops_from
type: obo vocabulary:Resource
in dataset: bioportal resource:bio2rdf.dataset.bioportal.R3
title: develops_from
type: ObjectProperty

hypha [fao:0001001]
bio2rdf vocabulary:namespace: fao
bio2rdf vocabulary:identifier: 0001001
type: fao resource [fao_vocabulary:Resource]
in dataset: bioportal resource:bio2rdf.dataset.bioportal.R3
title: hypha
type: Class
description: A threadlike, tubular filamentous fungal structure. [FAO:mcc, ISBN:0471522295]
subclass of: fungal structure [fao:0000001]

sterigma [fao:0000044]
bio2rdf vocabulary:namespace: fao
bio2rdf vocabulary:identifier: 0000044
type: fao resource [fao_vocabulary:Resource]
in dataset: bioportal resource:bio2rdf.dataset.bioportal.R3
title: sterigma
type: Class
description: A small hyphal branch or structure which supports a sporangium, a conidium, or a basidiospore. In species with biseriate (two layered) sterigmata such as A. nidulans, the first layer comprises primary sterigmata (metulae) and the second layer secondary sterigmata (phialides). Some species, e.g. A. fumigatus, A. oryzae, and others, have only phialides. [AspGD:mcc, ISBN:0471522295]
obo vocabulary:exact synonym: sterigmata (plural)
part_of [obo_vocabulary:part_of]: conidiophore [fao:0000043]
subclass of: obo vocabulary:Entity

phialide [fao:0000045]
bio2rdf vocabulary:namespace: fao
bio2rdf vocabulary:identifier: 0000045
type: fao resource [fao_vocabulary:Resource]
in dataset: bioportal resource:bio2rdf.dataset.bioportal.R3
title: phialide
type: Class
description: A specialized cell that buds from a metula on a developing conidiophore. Multiple phialides may bud from each metula. The phialides in turn divide asymmetrically to give rise to chains of conidia. [AspGD:mcc, PMID:9529886]
obo vocabulary:exact synonym: secondary sterigma
subclass of: sterigma [fao:0000044]

metula [fao:0000046]
bio2rdf vocabulary:namespace: fao
bio2rdf vocabulary:identifier: 0000046
type: fao resource [fao_vocabulary:Resource]
in dataset: bioportal resource:bio2rdf.dataset.bioportal.R3
title: metula
type: Class
description: A specialized cell borne on a conidiophore that gives rise to phialides during the process of conidiation. [AspGD:mcc, PMID:9529886]
obo vocabulary:exact synonym: metulae (plural)
obo vocabulary:exact synonym: primary sterigma
subclass of: sterigma [fao:0000044]

cleistothecium [fao:0000047]
bio2rdf vocabulary:namespace: fao
bio2rdf vocabulary:identifier: 0000047
type: fao resource [fao_vocabulary:Resource]
in dataset: bioportal resource:bio2rdf.dataset.bioportal.R3
title: cleistothecium
type: Class
description: A completely closed fruiting body formed by some fungi of the Ascomycota, containing asci. [AspGD:mcc, ISBN:0471522295]
subclass of: ascocarp [fao:0000008]

Hulle cell [fao:0000048]
bio2rdf vocabulary:namespace: fao
bio2rdf vocabulary:identifier: 0000048
type: fao resource [fao_vocabulary:Resource]
in dataset: bioportal resource:bio2rdf.dataset.bioportal.R3
title: Hulle cell
type: Class
description: A specialized multinucleate cell that originates from a nest-like aggregation of hyphae during sexual development. Hulle cells serve as nurse cells to the developing cleistothecium. Note that Hulle is properly written with an umlaut character on the u. [AspGD:mcc, PMID:19210625]
develops_from [obo_vocabulary:develops_from]: hypha [fao:0001001]
subclass of: obo vocabulary:Entity

conidiophore vesicle [fao:0000049]
bio2rdf vocabulary:namespace: fao
bio2rdf vocabulary:identifier: 0000049
type: fao resource [fao_vocabulary:Resource]
in dataset: bioportal resource:bio2rdf.dataset.bioportal.R3
title: conidiophore vesicle
type: Class
description: The swollen region at the apex of a conidiophore, bearing multiple metulae. [AspGD:mcc, PMID:9529886]
part_of [obo_vocabulary:part_of]: conidiophore [fao:0000043]
subclass of: obo vocabulary:Entity

conidiophore stalk [fao:0000050]
bio2rdf vocabulary:namespace: fao
bio2rdf vocabulary:identifier: 0000050
type: fao resource [fao_vocabulary:Resource]
in dataset: bioportal resource:bio2rdf.dataset.bioportal.R3
title: conidiophore stalk
type: Class
description: The elongated part of the conidiophore that extends, often aerially, from the growth substrate and supports the structures that bear conidia. [AspGD:mcc, PMID:9529886]
part_of [obo_vocabulary:part_of]: conidiophore [fao:0000043]
subclass of: obo vocabulary:Entity

oidium [fao:0000051]
bio2rdf vocabulary:namespace: fao
bio2rdf vocabulary:identifier: 0000051
type: fao resource [fao_vocabulary:Resource]
in dataset: bioportal resource:bio2rdf.dataset.bioportal.R3
title: oidium
type: Class
description: Oidia are borne a few at a time on very simple hyphae that protrude a short distance into the substrate, and are usually presumed not to constitute the main reproductive strategy of the fungus. [Wikipedia:Oidium]
x go [obo_vocabulary:x-go]: go:0034297
part_of [obo_vocabulary:part_of]: hypha [fao:0001001]
created_by [obo_vocabulary:created_by]: Maria
creation_date [obo_vocabulary:creation_date]: 2011-06-10T12:03:49Z
subclass of: obo vocabulary:Entity

go:0034297
bio2rdf vocabulary:namespace: go
bio2rdf vocabulary:identifier: 0034297
bio2rdf vocabulary:x-identifiers.org: http://identifiers.org/go/0034297
type: go resource [go_vocabulary:Resource]
in dataset: bioportal resource:bio2rdf.dataset.bioportal.R3

created_by [obo_vocabulary:created_by]
bio2rdf vocabulary:namespace: obo_vocabulary
bio2rdf vocabulary:identifier: created_by
type: obo vocabulary:Resource
in dataset: bioportal resource:bio2rdf.dataset.bioportal.R3
title: created_by
type: DatatypeProperty

creation_date [obo_vocabulary:creation_date]
bio2rdf vocabulary:namespace: obo_vocabulary
bio2rdf vocabulary:identifier: creation_date
type: obo vocabulary:Resource
in dataset: bioportal resource:bio2rdf.dataset.bioportal.R3
title: creation_date
type: DatatypeProperty

go:0043582
bio2rdf vocabulary:namespace: go
bio2rdf vocabulary:identifier: 0043582
bio2rdf vocabulary:x-identifiers.org: http://identifiers.org/go/0043582
type: go resource [go_vocabulary:Resource]
in dataset: bioportal resource:bio2rdf.dataset.bioportal.R3

zygosporangium [fao:0000053]
bio2rdf vocabulary:namespace: fao
bio2rdf vocabulary:identifier: 0000053
type: fao resource [fao_vocabulary:Resource]
in dataset: bioportal resource:bio2rdf.dataset.bioportal.R3
title: zygosporangium
type: Class
description: A zygosporangium is a thick-walled structure in which spores are produced, and is characteristic of the Zygomycetes. [FAO:curators]
x go [obo_vocabulary:x-go]: go:0075271
subclass of: sporangium [fao:0000052]
created_by [obo_vocabulary:created_by]: Maria
creation_date [obo_vocabulary:creation_date]: 2011-06-10T12:14:19Z

go:0075271
bio2rdf vocabulary:namespace: go
bio2rdf vocabulary:identifier: 0075271
bio2rdf vocabulary:x-identifiers.org: http://identifiers.org/go/0075271
type: go resource [go_vocabulary:Resource]
in dataset: bioportal resource:bio2rdf.dataset.bioportal.R3

aeciospore [fao:0000054]
bio2rdf vocabulary:namespace: fao
bio2rdf vocabulary:identifier: 0000054
type: fao resource [fao_vocabulary:Resource]
in dataset: bioportal resource:bio2rdf.dataset.bioportal.R3
title: aeciospore
type: Class
description: A dikaryotic spore, typically of a rust fungus, that is produced in an aecium; in heteroecious rusts, the aeciospore is a spore stage that infects the alternate host. [FAO:curators]
x go [obo_vocabulary:x-go]: go:0075247
subclass of: asexual spore [fao:0000023]
created_by [obo_vocabulary:created_by]: Maria
creation_date [obo_vocabulary:creation_date]: 2011-06-10T12:18:12Z

go:0075247
bio2rdf vocabulary:namespace: go
bio2rdf vocabulary:identifier: 0075247
bio2rdf vocabulary:x-identifiers.org: http://identifiers.org/go/0075247
type: go resource [go_vocabulary:Resource]
in dataset: bioportal resource:bio2rdf.dataset.bioportal.R3

aplanospore [fao:0000055]
bio2rdf vocabulary:namespace: fao
bio2rdf vocabulary:identifier: 0000055
type: fao resource [fao_vocabulary:Resource]
in dataset: bioportal resource:bio2rdf.dataset.bioportal.R3
title: aplanospore
type: Class
description: A nonmotile, asexual spore, usually a sporangiospore, common in the Phycomycetes. [answers.com:aplanospore, FAO:curators]
x go [obo_vocabulary:x-go]: go:0075289
subclass of: asexual spore [fao:0000023]
created_by [obo_vocabulary:created_by]: Maria
creation_date [obo_vocabulary:creation_date]: 2011-06-10T12:21:58Z

go:0075289
bio2rdf vocabulary:namespace: go
bio2rdf vocabulary:identifier: 0075289
bio2rdf vocabulary:x-identifiers.org: http://identifiers.org/go/0075289
type: go resource [go_vocabulary:Resource]
in dataset: bioportal resource:bio2rdf.dataset.bioportal.R3

aecium [fao:0000056]
bio2rdf vocabulary:namespace: fao
bio2rdf vocabulary:identifier: 0000056
type: fao resource [fao_vocabulary:Resource]
in dataset: bioportal resource:bio2rdf.dataset.bioportal.R3
title: aecium
type: Class
description: A cuplike structure of some rust fungi that contains chains of aeciospores. [FAO:curators]
x go [obo_vocabulary:x-go]: go:0075267
subclass of: sporophore [fao:0000010]
created_by [obo_vocabulary:created_by]: Maria
creation_date [obo_vocabulary:creation_date]: 2011-06-10T02:45:15Z

go:0075267
bio2rdf vocabulary:namespace: go
bio2rdf vocabulary:identifier: 0075267
bio2rdf vocabulary:x-identifiers.org: http://identifiers.org/go/0075267
type: go resource [go_vocabulary:Resource]
in dataset: bioportal resource:bio2rdf.dataset.bioportal.R3

telium [fao:0000057]
bio2rdf vocabulary:namespace: fao
bio2rdf vocabulary:identifier: 0000057
type: fao resource [fao_vocabulary:Resource]
in dataset: bioportal resource:bio2rdf.dataset.bioportal.R3
title: telium
type: Class
description: A teliospore-bearing sorus of the rust fungi. A pustule-like sorus formed on the tissue of a plant infected by a rust fungus and producing teliospores. [FAO:curators]
x go [obo_vocabulary:x-go]: go:0075275
subclass of: sporophore [fao:0000010]
created_by [obo_vocabulary:created_by]: Maria
creation_date [obo_vocabulary:creation_date]: 2011-06-10T02:47:39Z

go:0075275
bio2rdf vocabulary:namespace: go
bio2rdf vocabulary:identifier: 0075275
bio2rdf vocabulary:x-identifiers.org: http://identifiers.org/go/0075275
type: go resource [go_vocabulary:Resource]
in dataset: bioportal resource:bio2rdf.dataset.bioportal.R3

uredinium [fao:0000058]
bio2rdf vocabulary:namespace: fao
bio2rdf vocabulary:identifier: 0000058
type: fao resource [fao_vocabulary:Resource]
in dataset: bioportal resource:bio2rdf.dataset.bioportal.R3
title: uredinium
type: Class
description: A reddish, pustule-like structure formed by a rust fungus and consisting of uredospores. [FAO:curators]
x go [obo_vocabulary:x-go]: go:0075279
subclass of: sporophore [fao:0000010]
created_by [obo_vocabulary:created_by]: Maria
creation_date [obo_vocabulary:creation_date]: 2011-06-10T02:49:08Z

go:0075279
bio2rdf vocabulary:namespace: go
bio2rdf vocabulary:identifier: 0075279
bio2rdf vocabulary:x-identifiers.org: http://identifiers.org/go/0075279
type: go resource [go_vocabulary:Resource]
in dataset: bioportal resource:bio2rdf.dataset.bioportal.R3

conjugation tube [fao:0000059]
bio2rdf vocabulary:namespace: fao
bio2rdf vocabulary:identifier: 0000059
type: fao resource [fao_vocabulary:Resource]
in dataset: bioportal resource:bio2rdf.dataset.bioportal.R3
title: conjugation tube
type: Class
description: A tubular structure that connects two individuals during conjugation (usually forming in response to pheromone) and through which the transfer of genetic material can occur. (http://science.yourdictionary.com/conjugation-tube) [CGD:doi]
subclass of: mating cell [fao:0001022]
created_by [obo_vocabulary:created_by]: mariacostanzo
creation_date [obo_vocabulary:creation_date]: 2013-04-02T03:23:27Z

mating cell [fao:0001022]
bio2rdf vocabulary:namespace: fao
bio2rdf vocabulary:identifier: 0001022
type: fao resource [fao_vocabulary:Resource]
in dataset: bioportal resource:bio2rdf.dataset.bioportal.R3
title: mating cell
type: Class
description: A cell engaged in or about to engage in the process of mating; exhibits different morphology from a vegetative cell due to the action of mating pheromones. [FAO:mcc]
subclass of: unicellular structure [fao:0000018]

clamp cell [fao:0000060]
bio2rdf vocabulary:namespace: fao
bio2rdf vocabulary:identifier: 0000060
type: fao resource [fao_vocabulary:Resource]
in dataset: bioportal resource:bio2rdf.dataset.bioportal.R3
title: clamp cell
type: Class
description: A hyphal cell that forms a clamp connection, a structure that separates differing nuclei, which have been obtained through mating of hyphae of differing sexual types, into distinct hyphal segments that are separated by septa (cross walls). [CGD:doi]
subclass of: septate hypha [fao:0001009]
created_by [obo_vocabulary:created_by]: mariacostanzo
creation_date [obo_vocabulary:creation_date]: 2013-04-02T03:28:00Z

septate hypha [fao:0001009]
bio2rdf vocabulary:namespace: fao
bio2rdf vocabulary:identifier: 0001009
type: fao resource [fao_vocabulary:Resource]
in dataset: bioportal resource:bio2rdf.dataset.bioportal.R3
title: septate hypha
type: Class
description: A hypha that is divided internally by septa, or lateral cell walls. [FAO:mcc, ISBN:0471522295]
subclass of: hypha [fao:0001001]

fused clamp [fao:0000061]
bio2rdf vocabulary:namespace: fao
bio2rdf vocabulary:identifier: 0000061
type: fao resource [fao_vocabulary:Resource]
in dataset: bioportal resource:bio2rdf.dataset.bioportal.R3
title: fused clamp
type: Class
description: A structure produced in a dikaryotic hypha upon migration of the nuclei after mating of hyphae of differing sexual types. The clamp fuses to compartmentalize a nucleus within the subapical cell. Note: A hyphal cell that forms a clamp connection is called a clamp cell. [CGD:doi]
part_of [obo_vocabulary:part_of]: clamp cell [fao:0000060]
created_by [obo_vocabulary:created_by]: mariacostanzo
creation_date [obo_vocabulary:creation_date]: 2013-04-02T03:29:16Z
subclass of: obo vocabulary:Entity

unfused clamp [fao:0000062]
bio2rdf vocabulary:namespace: fao
bio2rdf vocabulary:identifier: 0000062
type: fao resource [fao_vocabulary:Resource]
in dataset: bioportal resource:bio2rdf.dataset.bioportal.R3
title: unfused clamp
type: Class
description: A structure that separates the nuclei within monokaryotic hyphae into distinct hyphal segments. Monokaryotic hyphae are produced during unisexual reproduction or hyphal development of a diploid, in contrast to dikaryotic hyphae which are produced by mating of hyphae of differing sexual types. [CGD:doi]
part_of [obo_vocabulary:part_of]: clamp cell [fao:0000060]
created_by [obo_vocabulary:created_by]: mariacostanzo
creation_date [obo_vocabulary:creation_date]: 2013-04-02T03:31:28Z
subclass of: obo vocabulary:Entity

titan cell [fao:0000063]
bio2rdf vocabulary:namespace: fao
bio2rdf vocabulary:identifier: 0000063
type: fao resource [fao_vocabulary:Resource]
in dataset: bioportal resource:bio2rdf.dataset.bioportal.R3
title: titan cell
type: Class
description: Large cells produced by fungi, such as Cryptococcus neoformans, that typically exhibit altered capsule structure, a thickened cell wall, increased ploidy, and resistance to nitrosative and oxidative stresses. [CGD:doi, PMID:21821718]
subclass of: vegetative cell [fao:0000032]
created_by [obo_vocabulary:created_by]: mariacostanzo
creation_date [obo_vocabulary:creation_date]: 2013-04-03T11:15:35Z

ballistospore [fao:0000064]
bio2rdf vocabulary:namespace: fao
bio2rdf vocabulary:identifier: 0000064
type: fao resource [fao_vocabulary:Resource]
in dataset: bioportal resource:bio2rdf.dataset.bioportal.R3
title: ballistospore
type: Class
description: A forcibly discharged asexual spore. With fungi, most types of basidiospores formed on basidia are discharged into the air from the tips of sterigmata. [CGD:doi]
obo vocabulary:exact synonym: ballistoconidium
subclass of: asexual spore [fao:0000023]
created_by [obo_vocabulary:created_by]: mariacostanzo
creation_date [obo_vocabulary:creation_date]: 2013-04-03T11:18:18Z

dikaryon [fao:0000065]
bio2rdf vocabulary:namespace: fao
bio2rdf vocabulary:identifier: 0000065
type: fao resource [fao_vocabulary:Resource]
in dataset: bioportal resource:bio2rdf.dataset.bioportal.R3
title: dikaryon
type: Class
description: The dikaryon is a cell pair observed in some fungi, within which two compatible nuclei of two cells pair off after plasmogamy and cohabit without karyogamy within a hyphal compartment, synchronously dividing such that pairs are maintained in the older cells and newer cells or hyphal tips are also binucleate. (http://en.wikipedia.org/wiki/Dikaryon) [CGD:doi]
part_of [obo_vocabulary:part_of]: hypha [fao:0001001]
created_by [obo_vocabulary:created_by]: mariacostanzo
creation_date [obo_vocabulary:creation_date]: 2013-04-03T11:20:00Z
subclass of: obo vocabulary:Entity

haustorium [fao:0000066]
bio2rdf vocabulary:namespace: fao
bio2rdf vocabulary:identifier: 0000066
type: fao resource [fao_vocabulary:Resource]
in dataset: bioportal resource:bio2rdf.dataset.bioportal.R3
title: haustorium
type: Class
description: The appendage or portion of a commensal or parasitic fungus (the hyphal tip) that penetrates the host's tissue and draws nutrients from it. Haustoria may arise from intercellular hyphae, appressoria, or external hyphae. [CGD:doi]
subclass of: hyphal tip [fao:0001011]
created_by [obo_vocabulary:created_by]: mariacostanzo
creation_date [obo_vocabulary:creation_date]: 2013-04-03T11:21:38Z

hyphal tip [fao:0001011]
bio2rdf vocabulary:namespace: fao
bio2rdf vocabulary:identifier: 0001011
type: fao resource [fao_vocabulary:Resource]
in dataset: bioportal resource:bio2rdf.dataset.bioportal.R3
title: hyphal tip
type: Class
description: The growing end of a hypha. [FAO:mcc, ISBN:0471522295]
part_of [obo_vocabulary:part_of]: hypha [fao:0001001]
subclass of: obo vocabulary:Entity

chlamydospore [fao:0000067]
bio2rdf vocabulary:namespace: fao
bio2rdf vocabulary:identifier: 0000067
type: fao resource [fao_vocabulary:Resource]
in dataset: bioportal resource:bio2rdf.dataset.bioportal.R3
title: chlamydospore
type: Class
description: A large, thick-walled resting spore produced by several kinds of fungi. [CGD:doi]
subclass of: asexual spore [fao:0000023]
created_by [obo_vocabulary:created_by]: mariacostanzo
creation_date [obo_vocabulary:creation_date]: 2013-04-03T11:41:14Z

pseudohypha [fao:0001002]
bio2rdf vocabulary:namespace: fao
bio2rdf vocabulary:identifier: 0001002
type: fao resource [fao_vocabulary:Resource]
in dataset: bioportal resource:bio2rdf.dataset.bioportal.R3
title: pseudohypha
type: Class
description: A chain of cells, formed under specific growth conditions, in which yeast-form fungal cells become elongated, bud only at the cellular pole distal to the mother cell, and fail to separate after division. Pseudohyphae exhibit constrictions at the cell-cell junctions, in contrast to true hyphae which are of more uniform diameter. [FAO:mcc]
subclass of: fungal structure [fao:0000001]

hypha in mycelium [fao:0001003]
bio2rdf vocabulary:namespace: fao
bio2rdf vocabulary:identifier: 0001003
type: fao resource [fao_vocabulary:Resource]
in dataset: bioportal resource:bio2rdf.dataset.bioportal.R3
title: hypha in mycelium
type: Class
description: A threadlike, tubular filamentous fungal structure, existing as part of a group or mass of such structures, the mycelium. [FAO:mcc, ISBN:0471522295]
subclass of: hypha [fao:0001001]
part_of [obo_vocabulary:part_of]: mycelium [fao:0000011]

septate hypha in mycelium [fao:0001004]
bio2rdf vocabulary:namespace: fao
bio2rdf vocabulary:identifier: 0001004
type: fao resource [fao_vocabulary:Resource]
in dataset: bioportal resource:bio2rdf.dataset.bioportal.R3
title: septate hypha in mycelium
type: Class
description: A hypha that is divided internally by septa, or lateral cell walls, that exists as part of a group or mass of such structures, the mycelium. [FAO:mcc, ISBN:0471522295]
subclass of: hypha in mycelium [fao:0001003]
subclass of: septate hypha [fao:0001009]

rhizomorph [fao:0001005]
bio2rdf vocabulary:namespace: fao
bio2rdf vocabulary:identifier: 0001005
type: fao resource [fao_vocabulary:Resource]
in dataset: bioportal resource:bio2rdf.dataset.bioportal.R3
title: rhizomorph
type: Class
description: A thick strand of hyphae oriented in parallel to each other, with a central channel through which nutrients are conducted. [FAO:clt, ISBN:0632030771]
subclass of: mycelium [fao:0000011]

mycelial cord [fao:0001006]
bio2rdf vocabulary:namespace: fao
bio2rdf vocabulary:identifier: 0001006
type: fao resource [fao_vocabulary:Resource]
in dataset: bioportal resource:bio2rdf.dataset.bioportal.R3
title: mycelial cord
type: Class
description: A thick strand of hyphae, oriented in parallel to each other, with specialized channels through which nutrients are conducted. [FAO:clt, ISBN:0632030771]
subclass of: mycelium [fao:0000011]

stroma [fao:0001007]
bio2rdf vocabulary:namespace: fao
bio2rdf vocabulary:identifier: 0001007
type: fao resource [fao_vocabulary:Resource]
in dataset: bioportal resource:bio2rdf.dataset.bioportal.R3
title: stroma
type: Class
description: A compact hyphal mass, on or in which fruiting bodies are formed. [FAO:mcc, ISBN:0471522295]
subclass of: mycelium [fao:0000011]

sclerotium [fao:0001008]
bio2rdf vocabulary:namespace: fao
bio2rdf vocabulary:identifier: 0001008
type: fao resource [fao_vocabulary:Resource]
in dataset: bioportal resource:bio2rdf.dataset.bioportal.R3
title: sclerotium
type: Class
description: A mycelial resting body, resistant to adverse environmental conditions. [FAO:mcc, ISBN:0471522295]
subclass of: mycelium [fao:0000011]

aseptate hypha [fao:0001010]
bio2rdf vocabulary:namespace: fao
bio2rdf vocabulary:identifier: 0001010
type: fao resource [fao_vocabulary:Resource]
in dataset: bioportal resource:bio2rdf.dataset.bioportal.R3
title: aseptate hypha
type: Class
description: A hypha whose growing portion contains multiple nuclei but is not divided internally by septa, or lateral cell walls. Septa may be present in older portions of the hypha, or at the base of reproductive structures. [FAO:mcc, ISBN:0471522295]
obo vocabulary:related synonym: coenocytic hypha
x fao [obo_vocabulary:x-fao]: fao:mcc
subclass of: hypha [fao:0001001]

x fao [obo_vocabulary:x-fao]
bio2rdf vocabulary:namespace: obo_vocabulary
bio2rdf vocabulary:identifier: x-fao
type: obo vocabulary:Resource
in dataset: bioportal resource:bio2rdf.dataset.bioportal.R3
title: x fao
type: ObjectProperty

fao:mcc
bio2rdf vocabulary:namespace: fao
bio2rdf vocabulary:identifier: mcc
type: fao resource [fao_vocabulary:Resource]
in dataset: bioportal resource:bio2rdf.dataset.bioportal.R3

hyphal tip, hypha in mycelium [fao:0001012]
bio2rdf vocabulary:namespace: fao
bio2rdf vocabulary:identifier: 0001012
type: fao resource [fao_vocabulary:Resource]
in dataset: bioportal resource:bio2rdf.dataset.bioportal.R3
title: hyphal tip, hypha in mycelium
type: Class
description: The growing end of a hypha existing as a part of a mass or group of hyphae, the mycelium. [FAO:mcc, ISBN:0471522295]
subclass of: hyphal tip [fao:0001011]
part_of [obo_vocabulary:part_of]: hypha in mycelium [fao:0001003]

hypha with dolipore septa, in mycelium [fao:0001013]
bio2rdf vocabulary:namespace: fao
bio2rdf vocabulary:identifier: 0001013
type: fao resource [fao_vocabulary:Resource]
in dataset: bioportal resource:bio2rdf.dataset.bioportal.R3
title: hypha with dolipore septa, in mycelium
type: Class
description: Hypha containing dolipore septa, or cross-walls, containing a central pore around which the septum is swollen to form a barrel-shaped structure; existing as part of a group or mass of similar hyphae, or mycelium. [FAO:mcc, ISBN:0471522295]
subclass of: septate hypha in mycelium [fao:0001004]

aseptate hypha in mycelium [fao:0001014]
bio2rdf vocabulary:namespace: fao
bio2rdf vocabulary:identifier: 0001014
type: fao resource [fao_vocabulary:Resource]
in dataset: bioportal resource:bio2rdf.dataset.bioportal.R3
title: aseptate hypha in mycelium
type: Class
description: A hypha whose growing portion contains multiple nuclei but is not divided internally by septa, or lateral cell walls; existing as part of a mass or group of such hyphae, the mycelium. [FAO:mcc, ISBN:0471522295]
obo vocabulary:related synonym: coenocytic hypha in mycelium
x fao [obo_vocabulary:x-fao]: fao:mcc
subclass of: hypha in mycelium [fao:0001003]
subclass of: aseptate hypha [fao:0001010]

hyphal tip, septate hypha in mycelium [fao:0001015]
bio2rdf vocabulary:namespace: fao
bio2rdf vocabulary:identifier: 0001015
type: fao resource [fao_vocabulary:Resource]
in dataset: bioportal resource:bio2rdf.dataset.bioportal.R3
title: hyphal tip, septate hypha in mycelium
type: Class
description: The growing end of a hypha that is divided internally by septa, or lateral cell walls, existing as part of a group or mass of such hyphae, the mycelium. [FAO:mcc, ISBN:0471522295]
subclass of: hyphal tip, hypha in mycelium [fao:0001012]
subclass of: hyphal tip, septate hypha [fao:0001016]
part_of [obo_vocabulary:part_of]: septate hypha in mycelium [fao:0001004]

hyphal tip, septate hypha [fao:0001016]
bio2rdf vocabulary:namespace: fao
bio2rdf vocabulary:identifier: 0001016
type: fao resource [fao_vocabulary:Resource]
in dataset: bioportal resource:bio2rdf.dataset.bioportal.R3
title: hyphal tip, septate hypha
type: Class
description: The growing end of a hypha that is divided internally by septa, or lateral cell walls. [FAO:mcc, ISBN:0471522295]
subclass of: hyphal tip [fao:0001011]
part_of [obo_vocabulary:part_of]: septate hypha [fao:0001009]

hyphal tip, hypha with dolipore septa in mycelium [fao:0001017]
bio2rdf vocabulary:namespace: fao
bio2rdf vocabulary:identifier: 0001017
type: fao resource [fao_vocabulary:Resource]
in dataset: bioportal resource:bio2rdf.dataset.bioportal.R3
title: hyphal tip, hypha with dolipore septa in mycelium
type: Class
description: The growing end of a hypha that is divided internally by dolipore septa, existing as part of a group or mass of such hyphae, the mycelium. [FAO:mcc, ISBN:0471522295]
subclass of: hyphal tip, septate hypha in mycelium [fao:0001015]
subclass of: hyphal tip, hypha with dolipore septa [fao:0001019]
part_of [obo_vocabulary:part_of]: hypha with dolipore septa, in mycelium [fao:0001013]

hyphal tip, hypha with dolipore septa [fao:0001019]
bio2rdf vocabulary:namespace: fao
bio2rdf vocabulary:identifier: 0001019
type: fao resource [fao_vocabulary:Resource]
in dataset: bioportal resource:bio2rdf.dataset.bioportal.R3
title: hyphal tip, hypha with dolipore septa
type: Class
description: The growing end of a hypha that is divided internally by septa, or cross-walls, of the dolipore type. [FAO:mcc, ISBN:0471522295]
subclass of: hyphal tip, septate hypha [fao:0001016]
part_of [obo_vocabulary:part_of]: hypha with dolipore septa [fao:0001018]

hypha with dolipore septa [fao:0001018]
bio2rdf vocabulary:namespace: fao
bio2rdf vocabulary:identifier: 0001018
type: fao resource [fao_vocabulary:Resource]
in dataset: bioportal resource:bio2rdf.dataset.bioportal.R3
title: hypha with dolipore septa
type: Class
description: Hypha containing dolipore septa, or cross-walls; septa contain a central pore around which the septum is swollen to form a barrel-shaped structure; pore is covered on each side of the septum by a septal pore cap (parenthosome). [FAO:mcc, ISBN:0471522295]
subclass of: septate hypha [fao:0001009]

hyphal tip, aseptate hypha in mycelium [fao:0001020]
bio2rdf vocabulary:namespace: fao
bio2rdf vocabulary:identifier: 0001020
type: fao resource [fao_vocabulary:Resource]
in dataset: bioportal resource:bio2rdf.dataset.bioportal.R3
title: hyphal tip, aseptate hypha in mycelium
type: Class
description: The growing tip of a hypha whose growing portion is not divided internally by septa, or lateral cell walls, existing as part of a group or mass of such hyphae, the mycelium. [FAO:mcc, ISBN:0471522295]
subclass of: hyphal tip, hypha in mycelium [fao:0001012]
subclass of: hyphal tip, aseptate hypha [fao:0001021]
part_of [obo_vocabulary:part_of]: aseptate hypha in mycelium [fao:0001014]

hyphal tip, aseptate hypha [fao:0001021]
bio2rdf vocabulary:namespace: fao
bio2rdf vocabulary:identifier: 0001021
type: fao resource [fao_vocabulary:Resource]
in dataset: bioportal resource:bio2rdf.dataset.bioportal.R3
title: hyphal tip, aseptate hypha
type: Class
description: The growing end of a hypha that is not divided internally by septa, or cross-walls. [FAO:mcc, ISBN:0471522295]
subclass of: hyphal tip [fao:0001011]
part_of [obo_vocabulary:part_of]: aseptate hypha [fao:0001010]

shmoo [fao:0001023]
bio2rdf vocabulary:namespace: fao
bio2rdf vocabulary:identifier: 0001023
type: fao resource [fao_vocabulary:Resource]
in dataset: bioportal resource:bio2rdf.dataset.bioportal.R3
title: shmoo
type: Class
description: An elongated, asymmetric cell formed before mating, in response to mating pheromone, by Saccharomyces species and other fungi with similar life cycles. Named after the Al Capp cartoon character, whose shape it resembles. [FAO:mcc, ISBN:0879693798]
subclass of: mating cell [fao:0001022]

develops from [obo:develops_from]
bio2rdf vocabulary:namespace: obo
bio2rdf vocabulary:identifier: develops_from
type: obo vocabulary:Resource
in dataset: bioportal resource:bio2rdf.dataset.bioportal.R3
title: develops from
type: Class
obo vocabulary:is transitive: true

is a [obo:is_a]
bio2rdf vocabulary:namespace: obo
bio2rdf vocabulary:identifier: is_a
type: obo vocabulary:Resource
in dataset: bioportal resource:bio2rdf.dataset.bioportal.R3
title: is a
type: Class

part of [obo:part_of]
bio2rdf vocabulary:namespace: obo
bio2rdf vocabulary:identifier: part_of
type: obo vocabulary:Resource
in dataset: bioportal resource:bio2rdf.dataset.bioportal.R3
title: part of
type: Class
is_symmetric [obo_vocabulary:is_symmetric]: true
obo vocabulary:is transitive: true

is_symmetric [obo_vocabulary:is_symmetric]
bio2rdf vocabulary:namespace: obo_vocabulary
bio2rdf vocabulary:identifier: is_symmetric
type: obo vocabulary:Resource
in dataset: bioportal resource:bio2rdf.dataset.bioportal.R3
title: is_symmetric
type: DatatypeProperty