lsr:caro
type: Ontology
obo vocabulary:format-version: 1.2
obo vocabulary:date: 12:09:2011 09:18
obo vocabulary:saved-by: djs93
obo vocabulary:auto-generated-by: OBO-Edit 2.1-beta16
obo vocabulary:default-namespace: caro
pairwise disjoint [obo_vocabulary:pairwise-disjoint]: true
ontology [obo_vocabulary:ontology]: CARO
obo vocabulary:treat-xrefs-as-equivalent: GO
ontology [obo_vocabulary:ontology]: caro

pairwise disjoint [obo_vocabulary:pairwise-disjoint]
bio2rdf vocabulary:namespace: obo_vocabulary
bio2rdf vocabulary:identifier: pairwise-disjoint
type: obo vocabulary:Resource
in dataset: bioportal resource:bio2rdf.dataset.bioportal.R3
title: pairwise disjoint
type: DatatypeProperty

ontology [obo_vocabulary:ontology]
bio2rdf vocabulary:namespace: obo_vocabulary
bio2rdf vocabulary:identifier: ontology
type: obo vocabulary:Resource
in dataset: bioportal resource:bio2rdf.dataset.bioportal.R3
title: ontology
type: DatatypeProperty

treat xrefs as equivalent [obo_vocabulary:treat-xrefs-as-equivalent]
bio2rdf vocabulary:namespace: obo_vocabulary
bio2rdf vocabulary:identifier: treat-xrefs-as-equivalent
type: obo vocabulary:Resource
in dataset: bioportal resource:bio2rdf.dataset.bioportal.R3
title: treat xrefs as equivalent
type: DatatypeProperty

anatomical entity [caro:0000000]
bio2rdf vocabulary:namespace: caro
bio2rdf vocabulary:identifier: 0000000
type: caro resource [caro_vocabulary:Resource]
in dataset: bioportal resource:bio2rdf.dataset.bioportal.R3
title: anatomical entity
type: Class
description: Biological entity that is either an individual member of a biological species or constitutes the structural organization of an individual member of a biological species. [CARO:MAH, FMA:62955]
subclass of: obo vocabulary:Entity

anatomical structure [caro:0000003]
bio2rdf vocabulary:namespace: caro
bio2rdf vocabulary:identifier: 0000003
type: caro resource [caro_vocabulary:Resource]
in dataset: bioportal resource:bio2rdf.dataset.bioportal.R3
title: anatomical structure
type: Class
description: Material anatomical entity that has inherent 3D shape and is generated by coordinated expression of the organism's own genome. [CARO:MAH, FMA:67135]
subclass of: material anatomical entity [caro:0000006]

material anatomical entity [caro:0000006]
bio2rdf vocabulary:namespace: caro
bio2rdf vocabulary:identifier: 0000006
type: caro resource [caro_vocabulary:Resource]
in dataset: bioportal resource:bio2rdf.dataset.bioportal.R3
title: material anatomical entity
type: Class
description: Anatomical entity that has mass. [CARO:MAH, FMA:67165]
subclass of: anatomical entity [caro:0000000]

portion of organism substance [caro:0000004]
bio2rdf vocabulary:namespace: caro
bio2rdf vocabulary:identifier: 0000004
type: caro resource [caro_vocabulary:Resource]
in dataset: bioportal resource:bio2rdf.dataset.bioportal.R3
title: portion of organism substance
type: Class
description: Material anatomical entity in a gaseous, liquid, semisolid or solid state; produced by anatomical structures or derived from inhaled and ingested substances that have been modified by anatomical structures as they pass through the body. [CARO:MAH, FMA:9669]
subclass of: material anatomical entity [caro:0000006]

anatomical space [caro:0000005]
bio2rdf vocabulary:namespace: caro
bio2rdf vocabulary:identifier: 0000005
type: caro resource [caro_vocabulary:Resource]
in dataset: bioportal resource:bio2rdf.dataset.bioportal.R3
title: anatomical space
type: Class
description: Non-material anatomical entity of three dimensions, that is generated by morphogenetic or other physiologic processes; is surrounded by one or more anatomical structures; contains one or more organism substances or anatomical structures. [CARO:MAH, FMA:5897]
subclass of: immaterial anatomical entity [caro:0000007]

immaterial anatomical entity [caro:0000007]
bio2rdf vocabulary:namespace: caro
bio2rdf vocabulary:identifier: 0000007
type: caro resource [caro_vocabulary:Resource]
in dataset: bioportal resource:bio2rdf.dataset.bioportal.R3
title: immaterial anatomical entity
type: Class
description: Anatomical entity that has no mass. [CARO:MAH, FMA:67112]
subclass of: anatomical entity [caro:0000000]

anatomical line [caro:0000008]
bio2rdf vocabulary:namespace: caro
bio2rdf vocabulary:identifier: 0000008
type: caro resource [caro_vocabulary:Resource]
in dataset: bioportal resource:bio2rdf.dataset.bioportal.R3
title: anatomical line
type: Class
description: Non-material anatomical entity of one dimension, which forms a boundary of an anatomical surface or is a modulation of an anatomical surface. [CARO:MAH, FMA:9657]
subclass of: immaterial anatomical entity [caro:0000007]

anatomical point [caro:0000009]
bio2rdf vocabulary:namespace: caro
bio2rdf vocabulary:identifier: 0000009
type: caro resource [caro_vocabulary:Resource]
in dataset: bioportal resource:bio2rdf.dataset.bioportal.R3
title: anatomical point
type: Class
description: Non-material anatomical entity of zero dimension, which forms a boundary of an anatomical line or surface. [CARO:MAH, FMA:9658]
subclass of: immaterial anatomical entity [caro:0000007]

anatomical surface [caro:0000010]
bio2rdf vocabulary:namespace: caro
bio2rdf vocabulary:identifier: 0000010
type: caro resource [caro_vocabulary:Resource]
in dataset: bioportal resource:bio2rdf.dataset.bioportal.R3
title: anatomical surface
type: Class
description: Non-material anatomical entity of two dimensions, that is demarcated by anatomical lines or points on the external or internal surfaces of anatomical structures. [CARO:MAH, FMA:24137]
subclass of: immaterial anatomical entity [caro:0000007]

anatomical system [caro:0000011]
bio2rdf vocabulary:namespace: caro
bio2rdf vocabulary:identifier: 0000011
type: caro resource [caro_vocabulary:Resource]
in dataset: bioportal resource:bio2rdf.dataset.bioportal.R3
title: anatomical system
type: Class
description: Anatomical group that is has as its parts distinct anatomical structures interconnected by anatomical structures at a lower level of granularity. [CARO:MAH, FMA:7149]
subclass of: anatomical group [caro:0000054]

anatomical group [caro:0000054]
bio2rdf vocabulary:namespace: caro
bio2rdf vocabulary:identifier: 0000054
type: caro resource [caro_vocabulary:Resource]
in dataset: bioportal resource:bio2rdf.dataset.bioportal.R3
title: anatomical group
type: Class
description: Anatomical structure consisting of at least two non-overlapping organs, multi-tissue aggregates or portion of tissues or cells of different types that does not constitute an organism, organ, multi-tissue aggregate, or portion of tissue. [CARO:MAH]
subclass of: anatomical structure [caro:0000003]

multi-cellular organism [caro:0000012]
bio2rdf vocabulary:namespace: caro
bio2rdf vocabulary:identifier: 0000012
type: caro resource [caro_vocabulary:Resource]
in dataset: bioportal resource:bio2rdf.dataset.bioportal.R3
title: multi-cellular organism
type: Class
description: Anatomical structure that is an individual member of a species and consists of more than one cell. [CARO:MAH, FMA:256135]
subclass of: anatomical structure [caro:0000003]

cell [caro:0000013]
bio2rdf vocabulary:namespace: caro
bio2rdf vocabulary:identifier: 0000013
type: caro resource [caro_vocabulary:Resource]
in dataset: bioportal resource:bio2rdf.dataset.bioportal.R3
title: cell
type: Class
description: Anatomical structure that has as its parts a maximally connected cell compartment surrounded by a plasma membrane. [CARO:MAH]
x go [obo_vocabulary:x-go]: go:0005623
subclass of: anatomical structure [caro:0000003]

x go [obo_vocabulary:x-go]
bio2rdf vocabulary:namespace: obo_vocabulary
bio2rdf vocabulary:identifier: x-go
type: obo vocabulary:Resource
in dataset: bioportal resource:bio2rdf.dataset.bioportal.R3
title: x go
type: ObjectProperty

go:0005623
bio2rdf vocabulary:namespace: go
bio2rdf vocabulary:identifier: 0005623
bio2rdf vocabulary:x-identifiers.org: http://identifiers.org/go/0005623
type: go resource [go_vocabulary:Resource]
in dataset: bioportal resource:bio2rdf.dataset.bioportal.R3

cell component [caro:0000014]
bio2rdf vocabulary:namespace: caro
bio2rdf vocabulary:identifier: 0000014
type: caro resource [caro_vocabulary:Resource]
in dataset: bioportal resource:bio2rdf.dataset.bioportal.R3
title: cell component
type: Class
description: Anatomical structure that is a direct part of the cell. [CARO:MAH, FMA:86454]
subclass of: anatomical structure [caro:0000003]
part_of [obo_vocabulary:part_of]: cell [caro:0000013]

part_of [obo_vocabulary:part_of]
bio2rdf vocabulary:namespace: obo_vocabulary
bio2rdf vocabulary:identifier: part_of
type: obo vocabulary:Resource
in dataset: bioportal resource:bio2rdf.dataset.bioportal.R3
title: part_of
type: ObjectProperty

compound organ component [caro:0000019]
bio2rdf vocabulary:namespace: caro
bio2rdf vocabulary:identifier: 0000019
type: caro resource [caro_vocabulary:Resource]
in dataset: bioportal resource:bio2rdf.dataset.bioportal.R3
title: compound organ component
type: Class
description: Multi-tissue structure that is part of a compound organ. [CARO:MAH]
subclass of: multi-tissue structure [caro:0000055]
part_of [obo_vocabulary:part_of]: compound organ [caro:0000024]

multi-tissue structure [caro:0000055]
bio2rdf vocabulary:namespace: caro
bio2rdf vocabulary:identifier: 0000055
type: caro resource [caro_vocabulary:Resource]
in dataset: bioportal resource:bio2rdf.dataset.bioportal.R3
title: multi-tissue structure
type: Class
description: Anatomical structure that has as its parts two or more portions of tissue of at least two different types and which through specific morphogenetic processes forms a single distinct structural unit demarcated by bona-fide boundaries from other distinct structural units of different types. [CARO:MAH]
subclass of: anatomical structure [caro:0000003]

compound organ [caro:0000024]
bio2rdf vocabulary:namespace: caro
bio2rdf vocabulary:identifier: 0000024
type: caro resource [caro_vocabulary:Resource]
in dataset: bioportal resource:bio2rdf.dataset.bioportal.R3
title: compound organ
type: Class
description: Anatomical structure that has as its parts two or more multi-tissue structures of at least two different types and which through specific morphogenetic processes forms a single distinct structural unit demarcated by bona fide boundaries from other distinct anatomical structures of different types. [CARO:MAH]
subclass of: anatomical structure [caro:0000003]

simple organ [caro:0000021]
bio2rdf vocabulary:namespace: caro
bio2rdf vocabulary:identifier: 0000021
type: caro resource [caro_vocabulary:Resource]
in dataset: bioportal resource:bio2rdf.dataset.bioportal.R3
title: simple organ
type: Class
description: Multi-tissue structure that is not part of a compound organ. [CARO:MAH]
subclass of: multi-tissue structure [caro:0000055]

male organism [caro:0000027]
bio2rdf vocabulary:namespace: caro
bio2rdf vocabulary:identifier: 0000027
type: caro resource [caro_vocabulary:Resource]
in dataset: bioportal resource:bio2rdf.dataset.bioportal.R3
title: male organism
type: Class
description: Gonochoristic organism that can produce male gametes. [CARO:MAH]
subclass of: gonochoristic organism [caro:0000048]

gonochoristic organism [caro:0000048]
bio2rdf vocabulary:namespace: caro
bio2rdf vocabulary:identifier: 0000048
type: caro resource [caro_vocabulary:Resource]
in dataset: bioportal resource:bio2rdf.dataset.bioportal.R3
title: gonochoristic organism
type: Class
description: Multi-cellular organism that has male and female sexes. [CARO:MAH]
related_synonym [obo_vocabulary:related_synonym]: monoecious organism
subclass of: multi-cellular organism [caro:0000012]

female organism [caro:0000028]
bio2rdf vocabulary:namespace: caro
bio2rdf vocabulary:identifier: 0000028
type: caro resource [caro_vocabulary:Resource]
in dataset: bioportal resource:bio2rdf.dataset.bioportal.R3
title: female organism
type: Class
description: Gonochoristic organism that can produce female gametes. [CARO:MAH]
subclass of: gonochoristic organism [caro:0000048]

hermaphroditic organism [caro:0000029]
bio2rdf vocabulary:namespace: caro
bio2rdf vocabulary:identifier: 0000029
type: caro resource [caro_vocabulary:Resource]
in dataset: bioportal resource:bio2rdf.dataset.bioportal.R3
title: hermaphroditic organism
type: Class
description: Multi-cellular organism that can produce both male and female gametes. [CARO:MAH]
related_synonym [obo_vocabulary:related_synonym]: dioecious organism
subclass of: multi-cellular organism [caro:0000012]

related_synonym [obo_vocabulary:related_synonym]
bio2rdf vocabulary:namespace: obo_vocabulary
bio2rdf vocabulary:identifier: related_synonym
type: obo vocabulary:Resource
in dataset: bioportal resource:bio2rdf.dataset.bioportal.R3
title: related_synonym
type: DatatypeProperty

asexual organism [caro:0000030]
bio2rdf vocabulary:namespace: caro
bio2rdf vocabulary:identifier: 0000030
type: caro resource [caro_vocabulary:Resource]
in dataset: bioportal resource:bio2rdf.dataset.bioportal.R3
title: asexual organism
type: Class
description: Multi-cellular organism that does not produce gametes. [CARO:MAH]
subclass of: multi-cellular organism [caro:0000012]

organism subdivision [caro:0000032]
bio2rdf vocabulary:namespace: caro
bio2rdf vocabulary:identifier: 0000032
type: caro resource [caro_vocabulary:Resource]
in dataset: bioportal resource:bio2rdf.dataset.bioportal.R3
title: organism subdivision
type: Class
description: Anatomical structure which is a primary subdivision of whole organism. The mereological sum of these is the whole organism. [CARO:MAH]
subclass of: anatomical structure [caro:0000003]

acellular anatomical structure [caro:0000040]
bio2rdf vocabulary:namespace: caro
bio2rdf vocabulary:identifier: 0000040
type: caro resource [caro_vocabulary:Resource]
in dataset: bioportal resource:bio2rdf.dataset.bioportal.R3
title: acellular anatomical structure
type: Class
description: Anatomical structure that consists of cell parts and cell substances and together does not constitute a cell or a tissue. [CARO:MAH, FMA:63863]
subclass of: anatomical structure [caro:0000003]

anatomical cluster [caro:0000041]
bio2rdf vocabulary:namespace: caro
bio2rdf vocabulary:identifier: 0000041
type: caro resource [caro_vocabulary:Resource]
in dataset: bioportal resource:bio2rdf.dataset.bioportal.R3
title: anatomical cluster
type: Class
description: Anatomical group that has its parts adjacent to one another. [CARO:MAH, FMA:49443]
subclass of: anatomical group [caro:0000054]

extraembryonic structure [caro:0000042]
bio2rdf vocabulary:namespace: caro
bio2rdf vocabulary:identifier: 0000042
type: caro resource [caro_vocabulary:Resource]
in dataset: bioportal resource:bio2rdf.dataset.bioportal.R3
title: extraembryonic structure
type: Class
description: Anatomical structure that is contiguous with the embryo and is comprised of portions of tissue or cells that will not contribute to the embryo. [CARO:MAH]
subclass of: anatomical structure [caro:0000003]

portion of tissue [caro:0000043]
bio2rdf vocabulary:namespace: caro
bio2rdf vocabulary:identifier: 0000043
type: caro resource [caro_vocabulary:Resource]
in dataset: bioportal resource:bio2rdf.dataset.bioportal.R3
title: portion of tissue
type: Class
description: Anatomical structure, that consists of similar cells and intercellular matrix, aggregated according to genetically determined spatial relationships. [CARO:MAH, FMA:9637]
subclass of: anatomical structure [caro:0000003]

sequential hermaphroditic organism [caro:0000045]
bio2rdf vocabulary:namespace: caro
bio2rdf vocabulary:identifier: 0000045
type: caro resource [caro_vocabulary:Resource]
in dataset: bioportal resource:bio2rdf.dataset.bioportal.R3
title: sequential hermaphroditic organism
type: Class
description: Hermaphroditic organism that produces gametes first of one sex, and then later of the other sex. [CARO:MAH]
related_synonym [obo_vocabulary:related_synonym]: consecutive hermaphroditic organism
subclass of: hermaphroditic organism [caro:0000029]

synchronous hermaphroditic organism [caro:0000046]
bio2rdf vocabulary:namespace: caro
bio2rdf vocabulary:identifier: 0000046
type: caro resource [caro_vocabulary:Resource]
in dataset: bioportal resource:bio2rdf.dataset.bioportal.R3
title: synchronous hermaphroditic organism
type: Class
description: Hermaphroditic organism that produces both male and female gametes at the same time. [CARO:MAH]
related_synonym [obo_vocabulary:related_synonym]: serially hermaphroditic organism
subclass of: hermaphroditic organism [caro:0000029]

protandrous hermaphroditic organism [caro:0000049]
bio2rdf vocabulary:namespace: caro
bio2rdf vocabulary:identifier: 0000049
type: caro resource [caro_vocabulary:Resource]
in dataset: bioportal resource:bio2rdf.dataset.bioportal.R3
title: protandrous hermaphroditic organism
type: Class
description: Sequential hermaphroditic organism that producesngametes first of the male sex, and then later of thenfemale sex. [CARO:MAH]
subclass of: sequential hermaphroditic organism [caro:0000045]

protogynous hermaphroditic organism [caro:0000050]
bio2rdf vocabulary:namespace: caro
bio2rdf vocabulary:identifier: 0000050
type: caro resource [caro_vocabulary:Resource]
in dataset: bioportal resource:bio2rdf.dataset.bioportal.R3
title: protogynous hermaphroditic organism
type: Class
description: Sequential hermaphroditic organism that producesngametes first of the female sex, and then later of thenmale sex. [CARO:MAH]
subclass of: sequential hermaphroditic organism [caro:0000045]

cell space [caro:0000062]
bio2rdf vocabulary:namespace: caro
bio2rdf vocabulary:identifier: 0000062
type: caro resource [caro_vocabulary:Resource]
in dataset: bioportal resource:bio2rdf.dataset.bioportal.R3
title: cell space
type: Class
description: Anatomical space that is part of a cell. [CARO:mah]
subclass of: anatomical space [caro:0000005]

portion of cell substance [caro:0000063]
bio2rdf vocabulary:namespace: caro
bio2rdf vocabulary:identifier: 0000063
type: caro resource [caro_vocabulary:Resource]
in dataset: bioportal resource:bio2rdf.dataset.bioportal.R3
title: portion of cell substance
type: Class
description: Portion of organism substance located within a cell. [CARO:mah]
subclass of: portion of organism substance [caro:0000004]

single cell organism [caro:0000064]
bio2rdf vocabulary:namespace: caro
bio2rdf vocabulary:identifier: 0000064
type: caro resource [caro_vocabulary:Resource]
in dataset: bioportal resource:bio2rdf.dataset.bioportal.R3
title: single cell organism
type: Class
description: Cell that is an individual member of a species. [CARO:MAH]
subclass of: cell [caro:0000013]

basal lamina [caro:0000065]
bio2rdf vocabulary:namespace: caro
bio2rdf vocabulary:identifier: 0000065
type: caro resource [caro_vocabulary:Resource]
in dataset: bioportal resource:bio2rdf.dataset.bioportal.R3
title: basal lamina
type: Class
description: Acellular anatomical structure that consists of a thin sheet of fibrous proteins that underlie and support the cells of an epithelium. It separates the cells of an epithelium from any underlying tissue. [CARO:MAH]
subclass of: acellular anatomical structure [caro:0000040]

epithelium [caro:0000066]
bio2rdf vocabulary:namespace: caro
bio2rdf vocabulary:identifier: 0000066
type: caro resource [caro_vocabulary:Resource]
in dataset: bioportal resource:bio2rdf.dataset.bioportal.R3
title: epithelium
type: Class
description: Portion of tissue, that consists of one or more layers of epithelial cells connected to each other by cell junctions and which is underlain by a basal lamina. [CARO:MAH, FMA:9639]
subclass of: portion of tissue [caro:0000043]

simple cuboidal epithelium [caro:0000067]
bio2rdf vocabulary:namespace: caro
bio2rdf vocabulary:identifier: 0000067
type: caro resource [caro_vocabulary:Resource]
in dataset: bioportal resource:bio2rdf.dataset.bioportal.R3
title: simple cuboidal epithelium
type: Class
description: Unilaminar epithelium that consists of a single layer of cuboidal cells. [CARO:MAH, FMA:45566]
subclass of: unilaminar epithelium [caro:0000073]

unilaminar epithelium [caro:0000073]
bio2rdf vocabulary:namespace: caro
bio2rdf vocabulary:identifier: 0000073
type: caro resource [caro_vocabulary:Resource]
in dataset: bioportal resource:bio2rdf.dataset.bioportal.R3
title: unilaminar epithelium
type: Class
description: Epithelium that consists of a single layer of epithelial cells. [CARO:MAH, FMA:45561]
subclass of: epithelium [caro:0000066]

simple columnar epithelium [caro:0000068]
bio2rdf vocabulary:namespace: caro
bio2rdf vocabulary:identifier: 0000068
type: caro resource [caro_vocabulary:Resource]
in dataset: bioportal resource:bio2rdf.dataset.bioportal.R3
title: simple columnar epithelium
type: Class
description: Unilaminar epithelium that consists of a single layer of columnar cells. [CARO:MAH, FMA:45567]
subclass of: unilaminar epithelium [caro:0000073]

multilaminar epithelium [caro:0000069]
bio2rdf vocabulary:namespace: caro
bio2rdf vocabulary:identifier: 0000069
type: caro resource [caro_vocabulary:Resource]
in dataset: bioportal resource:bio2rdf.dataset.bioportal.R3
title: multilaminar epithelium
type: Class
description: Epithelium that consists of more than one layer of epithelial cells. [CARO:MAH, FMA:45562]
subclass of: epithelium [caro:0000066]

simple squamous epithelium [caro:0000070]
bio2rdf vocabulary:namespace: caro
bio2rdf vocabulary:identifier: 0000070
type: caro resource [caro_vocabulary:Resource]
in dataset: bioportal resource:bio2rdf.dataset.bioportal.R3
title: simple squamous epithelium
type: Class
description: Unilaminar epithelium that consists of a single layer of squamous cells. [CARO:MAH, FMA:45565]
subclass of: unilaminar epithelium [caro:0000073]

atypical epithelium [caro:0000071]
bio2rdf vocabulary:namespace: caro
bio2rdf vocabulary:identifier: 0000071
type: caro resource [caro_vocabulary:Resource]
in dataset: bioportal resource:bio2rdf.dataset.bioportal.R3
title: atypical epithelium
type: Class
description: Epithelium that consists of epithelial cells not arranged in one ore more layers. [CARO:MAH]
subclass of: epithelium [caro:0000066]

cavitated compound organ [caro:0000072]
bio2rdf vocabulary:namespace: caro
bio2rdf vocabulary:identifier: 0000072
type: caro resource [caro_vocabulary:Resource]
in dataset: bioportal resource:bio2rdf.dataset.bioportal.R3
title: cavitated compound organ
type: Class
description: Compound organ that contains one or more macroscopic anatomical spaces. [CARO:MAH]
subclass of: compound organ [caro:0000024]

solid compound organ [caro:0000074]
bio2rdf vocabulary:namespace: caro
bio2rdf vocabulary:identifier: 0000074
type: caro resource [caro_vocabulary:Resource]
in dataset: bioportal resource:bio2rdf.dataset.bioportal.R3
title: solid compound organ
type: Class
description: Compound organ that does not contain macroscopic anatomical spaces. [CARO:MAH]
subclass of: compound organ [caro:0000024]

epithelial cell [caro:0000077]
bio2rdf vocabulary:namespace: caro
bio2rdf vocabulary:identifier: 0000077
type: caro resource [caro_vocabulary:Resource]
in dataset: bioportal resource:bio2rdf.dataset.bioportal.R3
title: epithelial cell
type: Class
description: Cell which has as its part a cytoskeleton that allows for tight cell to cell contact and which has apical-basal cell polarity. [CARO:MAH]
subclass of: cell [caro:0000013]

multi-cell-component structure [caro:0001000]
bio2rdf vocabulary:namespace: caro
bio2rdf vocabulary:identifier: 0001000
type: caro resource [caro_vocabulary:Resource]
in dataset: bioportal resource:bio2rdf.dataset.bioportal.R3
title: multi-cell-component structure
type: Class
description: A structure consisting of multiple cell components but which is not itself a cell and does not have (complete) cells as a part. [FBC:DOS]
subclass of: anatomical structure [caro:0000003]

neuron projection bundle [caro:0001001]
bio2rdf vocabulary:namespace: caro
bio2rdf vocabulary:identifier: 0001001
type: caro resource [caro_vocabulary:Resource]
in dataset: bioportal resource:bio2rdf.dataset.bioportal.R3
title: neuron projection bundle
type: Class
description: A fasciculated bundle of neuron projections (GO:0043005), largely or completely lacking synapses. [FBC:DOS]
obo vocabulary:exact synonym: nerve fiber bundle
subclass of: multi-cell-component structure [caro:0001000]

neuron projection bundle segment [caro:0001500]
bio2rdf vocabulary:namespace: caro
bio2rdf vocabulary:identifier: 0001500
type: caro resource [caro_vocabulary:Resource]
in dataset: bioportal resource:bio2rdf.dataset.bioportal.R3
title: neuron projection bundle segment
type: Class
description: A fiber-shaped subdivision of a neuron projection along its long axis. [CAROC:DOS]
subclass of: multi-cell-component structure [caro:0001000]
part_of [obo_vocabulary:part_of]: neuron projection bundle [caro:0001001]
created_by [obo_vocabulary:created_by]: djs93
creation_date [obo_vocabulary:creation_date]: 2011-09-10T04:22:25Z

created_by [obo_vocabulary:created_by]
bio2rdf vocabulary:namespace: obo_vocabulary
bio2rdf vocabulary:identifier: created_by
type: obo vocabulary:Resource
in dataset: bioportal resource:bio2rdf.dataset.bioportal.R3
title: created_by
type: DatatypeProperty

creation_date [obo_vocabulary:creation_date]
bio2rdf vocabulary:namespace: obo_vocabulary
bio2rdf vocabulary:identifier: creation_date
type: obo vocabulary:Resource
in dataset: bioportal resource:bio2rdf.dataset.bioportal.R3
title: creation_date
type: DatatypeProperty

neuron projection bundle subsegment [caro:0001501]
bio2rdf vocabulary:namespace: caro
bio2rdf vocabulary:identifier: 0001501
type: caro resource [caro_vocabulary:Resource]
in dataset: bioportal resource:bio2rdf.dataset.bioportal.R3
title: neuron projection bundle subsegment
type: Class
description: A subdivision of a neuron projection along its long axis that is sufficiently short that it is not fiber-shaped. [CAROC:DOS]
subclass of: multi-cell-component structure [caro:0001000]
part_of [obo_vocabulary:part_of]: neuron projection bundle [caro:0001001]
created_by [obo_vocabulary:created_by]: djs93
creation_date [obo_vocabulary:creation_date]: 2011-09-10T04:24:17Z

has_quality [obo:has_quality]
bio2rdf vocabulary:namespace: obo
bio2rdf vocabulary:identifier: has_quality
type: obo vocabulary:Resource
in dataset: bioportal resource:bio2rdf.dataset.bioportal.R3
title: has_quality
type: Class

overlaps [obo:overlaps]
bio2rdf vocabulary:namespace: obo
bio2rdf vocabulary:identifier: overlaps
type: obo vocabulary:Resource
in dataset: bioportal resource:bio2rdf.dataset.bioportal.R3
title: overlaps
type: Class

part_of [obo:part_of]
bio2rdf vocabulary:namespace: obo
bio2rdf vocabulary:identifier: part_of
type: obo vocabulary:Resource
in dataset: bioportal resource:bio2rdf.dataset.bioportal.R3
title: part_of
type: Class
is_transitive [obo_vocabulary:is_transitive]: true

is_transitive [obo_vocabulary:is_transitive]
bio2rdf vocabulary:namespace: obo_vocabulary
bio2rdf vocabulary:identifier: is_transitive
type: obo vocabulary:Resource
in dataset: bioportal resource:bio2rdf.dataset.bioportal.R3
title: is_transitive
type: DatatypeProperty