Obstetric Delivery Procedures
type: Class
definition: Delivery of the fetus and placenta under the care of an obstetrician or a health worker. Obstetric deliveries may involve physical, psychological, medical, or surgical interventions.
subclass of: Perinatal History

Perinatal History
type: Class
definition: Circumstances, procedures and processes associated with pregnancy and infancy, including procedures and processes such as labor and delivery, as well as complications that emerge prior to or immediately after birth.
subclass of: Medical History

Attention Deficit Disorder with Hyperactivity
type: Class
definition: A behavior disorder originating in childhood in which the essential features are signs of developmentally inappropriate inattention, impulsivity, and hyperactivity.
subclass of: Mental Disorders

Mental Disorders
type: Class
definition: Psychiatric illness or diseases manifested by breakdowns in the adaptational process expressed primarily as abnormalities of thought, feeling, and behavior producing either distress or impairment of function.
subclass of: Comorbidities

Psychiatric Hospitalization
type: Class
subclass of: Psychologic Indications
definition: Having been hospitalized in a psychiatric institution.

Psychologic Indications
type: Class
definition: Atypical thoughts, feelings, or behaviors that cause distress or impairment of function.
subclass of: Complaints and Indications

Personal Traits
type: Class
definition: The distinguishing qualities, or characteristics, belonging to an individual. The qualities that have been shown to be important for the autism spectrum disorder phenotype include, for example, language and other cognitive abilities, restricted, repetitive and stereotyped behaviors, aspects of executive functioning, and a range of emotional traits.
subclass of: Autism Phenotype

Autism Phenotype
type: Class
definition: Severe distortions in the development of many basic psychological functions that are not normal for any stage in development. These distortions are manifested in sustained social impairment, speech abnormalities, and peculiar motor movements.

Pervasive Child Development Disorders
type: Class
definition: Severe distortions in the development of many basic psychological functions that are not normal for any stage in development. These distortions are manifested in sustained social impairment, speech abnormalities, and peculiar motor movements.
subclass of: Primary Diagnosis

Primary Diagnosis
type: Class
definition: Presence of a diagnosis of autism spectrum disorder.
subclass of: Diagnosis

Ability to Convey Feelings
type: Class
subclass of: Ability to Convey Information
definition: The ability to understand and accurately express information regarding one's own thoughts, opinions, and feelings.

Ability to Convey Information
type: Class
subclass of: Conversational Skills
definition: The ability to understand and express a variety of types of information in conversation, including reporting of events, answering questions of others, and expressing one's own thoughts and feelings.

Gross Motor Skills
type: Class
subclass of: Motor Skills
definition: Skills that involve the large muscle groups, including movements of the arms, legs, feet, or the entire body.

Motor Skills
type: Class
definition: The performance of complex motor acts that involve the movement of muscles in the body.
subclass of: Personal Traits

Recognition and Responsiveness to Voice
type: Class
subclass of: Reciprocal Social Interaction
definition: Awareness of someone's voice when another individual begins speaking, and ability to turn, locate and focus on voice, including responding when name is called.

Reciprocal Social Interaction
type: Class
definition: Mutual actions and communicative exchanges among people in social settings.
subclass of: Interpersonal Interactions

Herpesviridae Infections
type: Class
subclass of: Virus Diseases
definition: Virus diseases caused by the herpesviridae.

Virus Diseases
type: Class
definition: A general term for diseases produced by viruses.
subclass of: Comorbidities

Autoimmune Diseases
type: Class
definition: Disorders that are characterized by the production of antibodies that react with host tissues or immune effector cells that are autoreactive to endogenous peptides.
subclass of: Comorbidities

Comorbidities
type: Class
definition: The presence of co-existing or additional diseases with reference to an initial diagnosis.
subclass of: Medical History

Respiratory Indications
type: Class
subclass of: Complaints and Indications
definition: Manifestations of diseases of the respiratory tract.

Complaints and Indications
type: Class
subclass of: Medical History
definition: Symptoms or features that signal the presence of a disease or condition.

Perinatal Exposures
type: Class
subclass of: Perinatal History
definition: Being subject during pregnancy or infancy to agents and other environmental factors, such as medications or other substances that could affect the development of the fetus or infant.

Stereotyped, Restricted, and Repetitive Behavior
type: Class
subclass of: Personal Traits
definition: Behaviors, interests, movements, or vocalizations that are repetitive and lack clear function and purpose.

Receptive Phonology
type: Class
definition: The ability to recognize and understand language sounds.
subclass of: Receptive Language

Receptive Language
type: Class
definition: The ability to understand language.
subclass of: Language Ability

Home Life Skills
type: Class
subclass of: Adaptive Life Skills
definition: Carrying out domestic and everyday actions and tasks, including adhering to household rules, caring for one's self and one's possessions, and performing household tasks.

Adaptive Life Skills
type: Class
subclass of: Social Competence
definition: Everyday skills that are needed at home and in the community.

Reading and Writing
type: Class
definition: Performing activities involved in the comprehension and production of written language for the purpose of obtaining general knowledge or specific information.
subclass of: Language Ability

Language Ability
type: Class
subclass of: Personal Traits
definition: The ability to use and comprehend the complex system of human communication. Individuals with autism spectrum disorder often have a range of receptive and expressive language impairments.

Phenylketonurias
type: Class
definition: A group of autosomal recessive disorders marked by a deficiency of the hepatic enzyme phenylalanine hydroxylase, or less frequently by reduced activity of dihydropteridine reductase (i.e., atypical phenylketonuria).
subclass of: Central Nervous System Diseases

Central Nervous System Diseases
type: Class
definition: Diseases of any component of the brain (including the cerebral hemispheres, diencephalon, brain stem, and cerebellum) or the spinal cord.
subclass of: Nervous System Diseases

Use of Free Time
type: Class
subclass of: Planning
definition: Engaging in any form of play, recreational, or leisure activity.

Planning
type: Class
subclass of: Executive Function
definition: A complex operation in which a sequence of actions must be constantly monitored, re-evaluated and updated.

Social Competence
type: Class
subclass of: Autism Phenotype
definition: The ability to function in social situations. Children and adults with autism spectrum disorder demonstrate some delays, deficits, or atypical characteristics in the frequency, type, and quality of social interactions and social relationships with other individuals. Research suggests that differences in social development characterize children with autism spectrum disorder from the earliest months, and that delays, deficits, or atypical characteristics in this domain may be a "core feature" of autism spectrum disorder.

Immoderate Behavior
type: Class
subclass of: Impulse Control and Regulation
definition: The inability to control and appropriately manage intensity of behavior, including excessive silliness, laughing, and loudness.

Impulse Control and Regulation
type: Class
definition: Mental functions that regulate and resist sudden intense urges to do something.
subclass of: Emotional Regulation and Control

Body Temperature Changes
type: Class
definition: Significant alterations in temperature of the human body, above or below 98.6 degrees Fahrenheit or 37 degrees Celsius when taken orally.
subclass of: Complaints and Indications

Smoking
type: Class
definition: Inhaling and exhaling the smoke of tobacco.
subclass of: Substance Abuse

Substance Abuse
type: Class
subclass of: Exposures
definition: Overuse or misuse of a drug, alcohol, or tobacco.

Depression
type: Class
subclass of: Mood
definition: A mood state characterized by sadness, despair, or discouragement, and melancholic feelings of grief or unhappiness.

Mood
type: Class
definition: A temporary state of mind or being.
subclass of: Emotional Traits

Gastroesophageal Reflux
type: Class
definition: Retrograde flow of gastric juice and/or duodenal contents into the distal esophagus, commonly due to incompetence of the lower esophageal sphincter.
subclass of: Gastrointestinal Diseases

Gastrointestinal Diseases
type: Class
subclass of: Comorbidities
definition: Diseases in any segment of the gastrointestinal tract from the esophagus to the rectum.

Mumps
type: Class
definition: An acute infectious disease caused by rubulavirus, spread by direct contact, airborne droplet nuclei, fomites contaminated by infectious saliva, and perhaps urine, and usually seen in children under the age of 15, although adults may also be affected.
subclass of: Virus Diseases

Asperger Syndrome
type: Class
definition: A childhood disorder predominately affecting boys. It is characterized by severe, sustained, clinically significant impairment of social interaction, and restricted repetitive and stereotyped patterns of behavior. There are no clinically significant delays in language or cognitive development.
subclass of: Primary Diagnosis

Numeracy
type: Class
definition: Skill with numbers and mathematics, such as counting, ordering sequences, and telling time.
subclass of: Analytic Capability

Analytic Capability
type: Class
subclass of: Cognitive Ability
definition: Skill in reasoning, including problem solving and numeracy.

Flexibility in Problem Solving
type: Class
subclass of: Mental Flexibility
definition: The ability to change strategies, or shift mental sets, when involved in problem-solving.

Mental Flexibility
type: Class
definition: The ability to shift to a different thought or action according to a change in situation.
subclass of: Executive Function

Reaction to Unexpected Change
type: Class
definition: Response to changes in situations or surroundings.
subclass of: Restricted and Repetitive Behavior

Restricted and Repetitive Behavior
type: Class
definition: Atypical behavior that involves both display of unusual or intense interests, and atypical movements such as hand flapping, finger movements, rocking or twirling.
subclass of: Stereotyped, Restricted, and Repetitive Behavior

Medical History
type: Class
definition: A record of a patient's background regarding health and the occurrence of disease events.
subclass of: Autism Phenotype

Social Anxiety
type: Class
subclass of: Interpersonal Interactions
definition: Apprehension or fear of social interaction or social situations in general.

Interpersonal Interactions
type: Class
subclass of: Social Competence
definition: The reciprocal interaction of two or more persons.

Newborn Exposures
type: Class
subclass of: Perinatal Exposures
definition: Potentially detrimental effects or harmful conditions to which a newborn is exposed.

Pregnancy Complications
type: Class
subclass of: Perinatal History
definition: Conditions or pathological processes associated with pregnancy. They can occur during or after pregnancy, and range from minor discomforts to serious diseases that require medical interventions.

Performance of Chores
type: Class
subclass of: Performance of Household Tasks
definition: Doing housework such as cleaning the house, tidying rooms, washing clothes, storing food and disposing of garbage.

Performance of Household Tasks
type: Class
subclass of: Home Life Skills
definition: Performing tasks necessary for the general management and upkeep of a household, including completing chores and preparing food.

Understanding Others' Expectations
type: Class
definition: The ability to understand obligations and accountability assumed in formal and informal relationships with others.
subclass of: Interpersonal Awareness

Interpersonal Awareness
type: Class
definition: Consciousness of contextually and socially appropriate manner, such as by showing consideration and esteem when appropriate, or responding to the feelings of others.
subclass of: Interpersonal Interactions

Initiating and Responding to Social Overtures
type: Class
definition: Showing interest in making social advances to initiate friendly interactions as well as positive responses to the social advances of others.
subclass of: Social Interest

Social Interest
type: Class
subclass of: Interpersonal Interactions
definition: Actively seeking out interactions with others.

Adherence to Rules in the Home
type: Class
subclass of: Home Life Skills
definition: Understanding and obeying rules that have been determined for appropriate behavior within the household.

Lack of Appropriate Guilt
type: Class
subclass of: Intentional Bad Behavior
definition: Absence of subjective feeling that one has transgressed a moral, social or ethical principle.

Intentional Bad Behavior
type: Class
subclass of: Recognition of Social Norms
definition: Deliberate engagement in disruptive or improper behavior.

Alcohol Drinking
type: Class
subclass of: Substance Abuse
definition: Ingesting alcoholic beverages on a regular basis.

Cognitive Ability
type: Class
definition: General mental function required to understand and integrate the various mental functions, including all cognitive functions and their development over the life span.
subclass of: Personal Traits

Using Language Appropriately
type: Class
definition: Using language according to the social conventions that govern conversational interactions, including being able to interpret speakers' intended meanings across a variety of social contexts.
subclass of: Ability to Converse in Social Settings

Ability to Converse in Social Settings
type: Class
definition: The ability to participate in and contribute to friendly and casual conversations with others in a contextually and socially appropriate manner, including asking questions relevant to the conversational topic.
subclass of: Conversational Skills

Thyroid Diseases
type: Class
subclass of: Endocrine System Diseases
definition: Pathological processes involving the thyroid gland.

Endocrine System Diseases
type: Class
definition: Pathological processes of the endocrine glands, and diseases resulting from abnormal level of available hormones.
subclass of: Comorbidities

Idiosyncratic and Routinized Speech
type: Class
subclass of: Language Ability
definition: Unusual speech, including formulaic speech, overreliance on a restricted range of expressions, echolalia, and idiosyncratic sound-meaning associations.

Fine Motor Skills
type: Class
definition: The small movements of the hands, wrists, fingers, feet, toes, lips, and tongue.
subclass of: Motor Skills

Awareness and Avoidance of Danger
type: Class
subclass of: Planning
definition: Avoiding risks and potentially hazardous situations that can lead to injury or harm.

Executive Function
type: Class
subclass of: Personal Traits
definition: A set of cognitive functions that controls complex, goal-directed thought and behavior. Executive function involves multiple domains, such as concept formation, goal management, cognitive flexibility, inhibition control, impulse control, and working memory. Executive function in autism spectrum disorder is a subject of continuing research.

Neurodegenerative Diseases
type: Class
definition: Hereditary and sporadic conditions which are characterized by progressive nervous system dysfunction. These disorders are often associated with atrophy of the affected central or peripheral nervous system structures.
subclass of: Nervous System Diseases

Nervous System Diseases
type: Class
subclass of: Comorbidities
definition: Diseases of the central and peripheral nervous system. This includes disorders of the brain, spinal cord, cranial nerves, peripheral nerves, nerve roots, autonomic nervous system, neuromuscular junction, and muscle.

Migraine Disorders
type: Class
definition: A class of disabling primary headache disorders, characterized by recurrent unilateral pulsatile headaches. The two major subtypes are common migraine (without aura) and classic migraine (with aura or neurological symptoms).
subclass of: Central Nervous System Diseases

Dietary Restrictions
type: Class
subclass of: Exposures
definition: Limiting the quantity and quality of food intake.

Exposures
type: Class
subclass of: Medical History
definition: Environmental or other conditions that may have an impact on the etiology or course of a disorder.

Understanding Context
type: Class
definition: The ability to recognize the communication situation, including the mood, opinions and comprehension level of other participants, and to modify one's language and responses accordingly.
subclass of: Conversational Skills

Conversational Skills
type: Class
subclass of: Recognition of Social Norms
definition: Abilities needed to start, sustain and end an interchange of thoughts and ideas, carried out by means of spoken, written, sign or other forms of language, with one or more people one knows or who are strangers, in formal or casual settings.

Allergies
type: Class
subclass of: Autoimmune Diseases
definition: Altered reactivity to an antigen, which can result in pathologic reactions upon subsequent exposure to that particular antigen.

Labor Presentation
type: Class
definition: The position or orientation of the fetus at near term or during obstetric labor, determined by its relation to the spine of the mother and the birth canal.
subclass of: Perinatal History

Diagnosis
type: Class
subclass of: Medical History
definition: The determination of the nature of a disease or condition, or the distinguishing of one disease or condition from another. Assessment may be made through physical examination, laboratory tests, or the like.

Skill in Understanding Non-Literal Meaning
type: Class
definition: The ability to recognize and comprehend figurative and metaphorical meanings.
subclass of: Understanding Context

Unusual Sensory Interests
type: Class
subclass of: Restricted and Unusual Interests
definition: Atypical degree of interest in sensory stimuli, such as flashing lights, textures, or sounds.

Restricted and Unusual Interests
type: Class
definition: Atypical or highly limited interest in specific objects or topics.
subclass of: Restricted and Repetitive Behavior

Self-Injurious Behavior
type: Class
definition: Behavior in which persons intentionally hurt or harm themselves.
subclass of: Emotional Regulation and Control

Emotional Regulation and Control
type: Class
definition: Directing or governing one`s own emotions. Individuals with autism spectrum disorder can react negatively to their environment and at times may engage in emotional outbursts.
subclass of: Executive Function

Reasoning
type: Class
definition: Thinking that is coherent and logical, involving ability to follow instructions as well as problem solving ability.
subclass of: Analytic Capability

Job Performance
type: Class
definition: Quality of the work conducted at one's place of employment.
subclass of: Community Life Skills

Community Life Skills
type: Class
subclass of: Adaptive Life Skills
definition: Skills that allow successful engagement in all aspects of community social life, such as engaging in organized groups, recreation, and citizenship.

Muscle Weakness
type: Class
definition: A vague complaint of debility, fatigue, or exhaustion attributable to weakness of various muscles.
subclass of: Neurologic Indications

Neurologic Indications
type: Class
subclass of: Complaints and Indications
definition: Symptoms related to the nervous system.

Performance in School
type: Class
subclass of: Community Life Skills
definition: Performing activities involved in obtaining an education.

Tics and Mannerisms
type: Class
subclass of: Involuntary Behaviors
definition: Habitual, repeated, rapid contraction of certain muscles, resulting in stereotyped individualized actions that can be voluntarily suppressed for only brief periods. They tend to be aggravated by emotional stress.

Involuntary Behaviors
type: Class
definition: Non-intentional, non-purposive behaviors, including perseveration, habitual repeated movements, and extreme sensitivity to stimuli.
subclass of: Stereotyped, Restricted, and Repetitive Behavior

Post-Traumatic Stress Disorders
type: Class
definition: A class of traumatic stress disorders with symptoms that last more than one month. There are various forms of post-traumatic stress disorder, depending on the time of onset and the duration of these stress symptoms. In the acute form, the duration of the symptoms is between 1 to 3 months. In the chronic form, symptoms last more than 3 months. With delayed onset, symptoms develop more than 6 months after the traumatic event.
subclass of: Anxiety Disorders

Anxiety Disorders
type: Class
subclass of: Mental Disorders
definition: Persistent and disabling anxiety.

Congenital Heart Defects
type: Class
subclass of: Congenital Abnormalities
definition: Developmental abnormalities involving structures of the heart. These defects are present at birth but may be discovered later in life.

Congenital Abnormalities
type: Class
definition: Malformations of organs or body parts during development in utero.
subclass of: Comorbidities

Preparation of Food
type: Class
definition: Planning, organizing, cooking and serving simple and complex meals for oneself and others.
subclass of: Performance of Household Tasks

Awareness of Social and Personal Space
type: Class
subclass of: Awareness of Social Cues
definition: Being aware of and maintaining a distance between oneself and others that is contextually, socially and culturally appropriate.

Awareness of Social Cues
type: Class
subclass of: Recognition of Social Norms
definition: Giving and reacting appropriately to signs and hints that occur in social interactions. This ability can be compromised in individuals with autism spectrum disorder.

Strange or Illogical Ideas
type: Class
definition: Expression of abnormal or nonsensical thoughts.
subclass of: Psychologic Indications

Rett Syndrome
type: Class
definition: An inherited neurological developmental disorder that is associated with X-linked inheritance and may be lethal in utero to hemizygous males. The affected female is normal until the age of 6-25 months when progressive loss of voluntary control of hand movements and communication skills, ataxia, seizures, autistic behavior, intermittent hyperventilation, and hyperammonemia appear.
subclass of: Primary Diagnosis

Metabolic Indications
type: Class
subclass of: Complaints and Indications
definition: Abnormal processes that involve the physical and chemical processes that convert or use energy within the body.

Sexual Issues
type: Class
definition: Problems in sexual desire or behavior.
subclass of: Psychologic Indications

Intense Interests
type: Class
definition: Extremely strong interest in specific objects or topics.
subclass of: Restricted and Unusual Interests

Substance Abuse During Pregnancy
type: Class
subclass of: Perinatal Exposures
definition: Being subject during pregnancy to substance use that could affect the development of the fetus and the well-being of the mother.

Schizophrenia and Disorders with Psychotic Features
type: Class
subclass of: Mental Disorders
definition: Marked disorders of thought (delusions, hallucinations, or other thought disorder accompanied by disordered affect or behavior), and deterioration from a previous level of functioning.

Tourette Syndrome
type: Class
definition: A neuropsychological disorder related to alterations in dopamine metabolism and neurotransmission involving frontal-subcortical neuronal circuits. Both multiple motor and one or more vocal tics are present, with tics occurring many times a day, nearly daily, over a period of more than one year.
subclass of: Central Nervous System Diseases

Task Completion
type: Class
subclass of: Task Performance
definition: Finishing a task.

Task Performance
type: Class
subclass of: Working Memory
definition: Carrying out simple or complex and coordinated actions related to the mental and physical components of a single task, such as initiating a task, organizing time, space and materials for a task, pacing task performance, and carrying out, completing, and sustaining a task.

Regression of Language Skills
type: Class
subclass of: Development or Regression of Language Skills
definition: Loss of language ability after some language has already been acquired.

Development or Regression of Language Skills
type: Class
definition: The acquisition or loss of the ability to communicate using language.
subclass of: Language Ability

Asthma
type: Class
subclass of: Autoimmune Diseases
definition: A form of bronchial disorder with three distinct components: airway hyper-responsiveness, airway inflammation, and intermittent airway obstruction.

Rubella
type: Class
subclass of: Virus Diseases
definition: An acute, usually benign, infectious disease caused by the rubella virus, and most often affecting children and non-immune young adults, in which the virus enters the respiratory tract via droplet nuclei and spreads to the lymphatic system.

Integrated Verbal and NonVerbal Communication
type: Class
definition: Matching non-verbal communication, such as gestures and facial expressions, with meaning conveyed through verbal communication.
subclass of: Language Ability

Visual Thinking
type: Class
definition: Apprehending some aspect of an object or situation, through primarily visual-spatial mental functions.
subclass of: Abstract Thinking

Abstract Thinking
type: Class
definition: The conceptual process of creating ideas and generalizations that are distinct from concrete realities, specific objects, or actual instances.
subclass of: Cognitive Ability

Interactions with Friends and Family
type: Class
definition: Relationships, including conversations and joint activities, with family members and friends.
subclass of: Social Interest

Fragile X Syndrome
type: Class
definition: A condition characterized genotypically by mutation of the distal end of the long arm of the X chromosome (at gene loci FRAXA or FRAXE) and phenotypically by cognitive impairment, hyperactivity, seizures, language delay, and enlargement of the ears, head, and testes.
subclass of: Mental Retardation

Mental Retardation
type: Class
subclass of: Mental Disorders
definition: Subnormal intellectual functioning which originates during the developmental period. This has multiple potential etiologies, including genetic defects and perinatal insults. Intelligence quotient (IQ) scores are commonly used to determine whether an individual is mentally retarded.

Engaging in Social Conversation
type: Class
definition: Participating in and enjoying interactions with others where the purpose is to be friendly or social, rather than expressing explicit information or needs.
subclass of: Social Interest

Suspicious of Others
type: Class
subclass of: Psychologic Indications
definition: Unwarranted mistrust of others.

Complications in Infancy
type: Class
subclass of: Perinatal History
definition: Abnormal clinical manifestations that occur in infancy.

Showing Emotion
type: Class
subclass of: Affect
definition: Showing outward display of emotions that can be perceived by others.

Affect
type: Class
definition: Conveying meaning by movements of the body, such as facial gestures, arm and hand movements, and postures.
subclass of: Emotional Traits

Imagination
type: Class
definition: The ability to perceive new relationships and to derive new ideas and solve problems by pursuing nontraditional patterns of thinking.
subclass of: Abstract Thinking

Toileting
type: Class
definition: Planning and carrying out the appropriate elimination of human waste and cleaning oneself afterwards.
subclass of: Self-Care

Self-Care
type: Class
subclass of: Home Life Skills
definition: Caring for oneself, including washing and drying oneself, caring for one's body and body parts, proper use of the bathroom as needed, dressing, eating and drinking.

Onset of Symptoms
type: Class
definition: Â When symptoms of autism spectrum disorder first appear.
subclass of: Diagnosis

Abnormal Activity or Energy Level
type: Class
definition: Poor ability to regulate the speed of behavior or response time that involves both motor and psychological components.
subclass of: Neurologic Indications

Emotional Traits
type: Class
subclass of: Personal Traits
definition: The characteristics of a person's emotional makeup.

Functional Laterality
type: Class
definition: Behavioral manifestations of cerebral dominance in which there is preferential use and superior functioning of either the left or the right side, as in the preferred use of the right hand or right foot.
subclass of: Motor Skills

Language Development
type: Class
definition: The gradual expansion in complexity and meaning of symbols and sounds as perceived and interpreted by the individual through a maturational and learning process.
subclass of: Development or Regression of Language Skills

Use of Everyday Household Items
type: Class
subclass of: Home Life Skills
definition: Using items in the household such as cookware, washing machines, irons, and vacuum cleaners.

Bacterial Infections
type: Class
definition: Infections caused by bacteria.
subclass of: Comorbidities

Expressive Phonology
type: Class
definition: The ability to produce sounds according to the sound patterns of language.
subclass of: Expressive Language

Expressive Language
type: Class
subclass of: Language Ability
definition: The ability to produce and use language in an accurate and meaningful way.

Emotional Outbursts
type: Class
subclass of: Control of Emotional Reactions
definition: An extreme, violent display of emotion, often in response to frustration, including temper tantrums.

Control of Emotional Reactions
type: Class
subclass of: Emotional Regulation and Control
definition: The ability to control and appropriately manage the experience and display of emotions in response to external stimuli.

Ulcerative Colitis
type: Class
definition: Inflammation of the colon that is predominantly confined to the mucosa. Its major symptoms include diarrhea, rectal bleeding, the passage of mucus, and abdominal pain.
subclass of: Inflammatory Bowel Diseases

Inflammatory Bowel Diseases
type: Class
definition: Chronic, non-specific inflammation of the gastrointestinal tract.
subclass of: Gastrointestinal Diseases

Form Perception
type: Class
definition: The sensory discrimination of a pattern shape or outline.
subclass of: Visual Perception

Visual Perception
type: Class
definition: Mental functions involved in discriminating shape, size, color and other ocular stimuli. Many individuals with autism spectrum disorder show superior perceptual skills relative to the general population.
subclass of: Cognitive Ability

Pain
type: Class
subclass of: Neurologic Indications
definition: Physical suffering or discomfort.

Prosody
type: Class
definition: The ability to produce the appropriate rhythm, stress, and intonation of speech.
subclass of: Expressive Phonology

Smith-Lemli-Opitz Syndrome
type: Class
subclass of: Congenital Abnormalities
definition: An autosomal recessive disorder of cholesterol metabolism.

Vocalizations
type: Class
subclass of: Expressive Phonology
definition: Speech-like and non-speech sounds.

Reaction to Sensory Stimuli
type: Class
definition: Extreme sensitivity to external stimuli such as noises, bright lights, smells and textures.
subclass of: Involuntary Behaviors

Down Syndrome
type: Class
definition: A chromosome disorder associated either with an extra chromosome 21 or an effective trisomy for chromosome 21. Clinical manifestations include hypotonia, short stature, brachycephaly, upslanting palpebral fissures, epicanthus, Brushfield spots on the iris, protruding tongue, small ears, short, broad hands, fifth finger clinodactyly, Simian crease, and moderate to severe mental retardation.
subclass of: Mental Retardation

Adherence to Rituals and Routines
type: Class
subclass of: Restricted and Repetitive Behavior
definition: Intolerance for deviation from routine, or Insistence on a specific order.

Understanding Logical Progression
type: Class
subclass of: Reasoning
definition: Understanding how logically connected events relate to each other, such as understanding connections and order in a sequence.

Pattern Recognition and Rendering
type: Class
subclass of: Visual Perception
definition: The analysis of a critical number of sensory stimuli or facts (the pattern) by processes such as vision, touch, or hearing, and the ability to produce patterns through drawing and other means.

Ability to Convey Correct Information
type: Class
definition: The ability to understand and express accurate and relevant information during conversations, such as correctly answering questions of others.
subclass of: Ability to Convey Information

Anxiety
type: Class
definition: Feeling unreasonably or excessively afraid of impending actual or imagined danger; including feelings of panic and phobias.
subclass of: Mood

Insistence on Order
type: Class
definition: Insistence on an extreme degree of order in the surrounding environment, including placement and arrangement of specific objects.
subclass of: Adherence to Rituals and Routines

Restricted Range of Interests
type: Class
definition: Possessing a narrow range of interests in objects or topics.
subclass of: Restricted and Unusual Interests

Depressive Disorder
type: Class
subclass of: Mood Disorders
definition: An affective disorder manifested by either a dysphoric mood or loss of interest or pleasure in usual activities. The mood disturbance is prominent and relatively persistent.

Mood Disorders
type: Class
definition: Those disorders that have a disturbance in mood as their predominant feature.
subclass of: Mental Disorders

Childhood Disintegrative Disorder
type: Class
definition: A marked regression in multiple areas of functioning following a period of apparently normal development.
subclass of: Mental Disorders

Cri-du-Chat Syndrome
type: Class
subclass of: Congenital Abnormalities
definition: An infantile syndrome characterized by a cat-like cry, failure to thrive, microcephaly, mental retardation, spastic quadriparesis, micro- and retrognathia, glossoptosis, bilateral epicanthus, hypertelorism, and tiny external genitalia.

Money Management
type: Class
subclass of: Community Life Skills
definition: Using and saving money responsibly.

Engaging in Social Play
type: Class
subclass of: Interactions with Friends and Family
definition: Participating in and enjoying structured and unstructured games and spontaneous recreation.

Vaccination
type: Class
definition: Administration of vaccines to stimulate the host's immune response. This includes any preparation intended for active immunological prophylaxis.
subclass of: Exposures

Stomach Ulcer
type: Class
definition: Ulceration of the gastric mucosa due to contact with gastric juice.
subclass of: Gastrointestinal Diseases

Cranial Nerve Diseases
type: Class
subclass of: Nervous System Diseases
definition: Disorders of one or more of the twelve cranial nerves. With the exception of the optic and olfactory nerves, this includes disorders of the brain stem nuclei from which the cranial nerves originate or terminate.

Recognition of Social Norms
type: Class
subclass of: Social Competence
definition: Awareness of rules for social conduct, or standards which comprise a cultural definition of desirable or acceptable behavior.

Self Concept
type: Class
subclass of: Emotional Traits
definition: A person's view of himself, including confidence in one's personal traits and abilities.

Bipolar Disorder
type: Class
subclass of: Mood Disorders
definition: A major affective disorder marked by severe mood swings (manic or major depressive episodes) and a tendency to remission and recurrence.

Receptive Morphology
type: Class
subclass of: Receptive Language
definition: The ability to understand the structure and constituent parts of a word.

Acting Before Thinking
type: Class
subclass of: Impulse Control and Regulation
definition: Taking action before considering the consequences or impact of such action.

Keeps to Self
type: Class
definition: Generally remaining isolated; avoiding interactions; preferring to be alone rather than with others.
subclass of: Social Interest

Repetitive Actions
type: Class
definition: Performing the same action repeatedly.
subclass of: Adherence to Rituals and Routines

Skin Indications
type: Class
subclass of: Complaints and Indications
definition: Dermatologic problems.

Eating Ability
type: Class
subclass of: Self-Care
definition: Indicating need for, and carrying out the coordinated tasks and actions of eating food that has been served or taking hold of a drink, bringing it to the mouth and consuming it in culturally acceptable ways.

Color Perception
type: Class
subclass of: Visual Perception
definition: Mental processing of chromatic signals from the eye by the visual cortex where they are converted into symbolic representations.

Intentional Cruelty
type: Class
definition: Deliberately taking actions that cause physical or psychological pain for others.
subclass of: Intentional Bad Behavior

Medications During Pregnancy
type: Class
definition: Being subject during pregnancy to medications that could affect the development of the fetus and the well-being of the mother.
subclass of: Perinatal Exposures

Congenital Kidney Defect
type: Class
subclass of: Congenital Abnormalities
definition: A kidney abnormality that is present from birth.

Lead Exposure
type: Class
definition: History of exposure and possible poisoning due to absorption or ingestion of lead.
subclass of: Exposures

Initiating Social Interaction
type: Class
subclass of: Initiating and Responding to Social Overtures
definition: Starting interactions with others, including introducing oneself and actively trying to make friends.

Dietary Supplements
type: Class
subclass of: Exposures
definition: Products in capsule, tablet or liquid form that provide essential nutrients, such as a vitamin, an essential mineral, a protein, an herb, or similar nutritional substance.

Procedures During Pregnancy
type: Class
subclass of: Perinatal History
definition: Diagnostic and treatment techniques including surgery, hospitalization, etc. that occur during pregnancy or labor and delivery.

Prader-Willi Syndrome
type: Class
subclass of: Mental Retardation
definition: An autosomal dominant disorder caused by deletion of the proximal long arm of the paternal chromosome 15 (15q11-q13) or by inheritance of both of the pair of chromosomes 15 from the mother which are imprinted and hence silenced. Clinical manifestations include mental retardation, muscular hypotonia, hyperphagia, obesity, short stature hypogonadism, strabismus, and hypersomnolence.

Social Awkwardness
type: Class
definition: The inability to conduct oneself with ease in social situations.
subclass of: Interpersonal Interactions

Sharing
type: Class
subclass of: Interactions with Friends and Family
definition: Offering and allowing others to use possessions, such as letting another child play with one's own toys.

Epilepsy
type: Class
subclass of: Central Nervous System Diseases
definition: A disorder characterized by recurrent episodes of paroxysmal brain dysfunction due to a sudden, disorderly, and excessive neuronal discharge. Epilepsy classification systems are generally based upon: (1) clinical features of the seizure episodes, (2) etiology, (3) anatomic site of seizure origin, (4) tendency to spread to other structures in the brain, and (5) temporal patterns.

Obsessive-Compulsive Disorder
type: Class
definition: An anxiety disorder characterized by recurrent, persistent obsessions or compulsions. Obsessions are the intrusive ideas, thoughts, or images that are experienced as senseless or repugnant. Compulsions are repetitive and seemingly purposeful behavior which the individual generally recognizes as senseless and from which the individual does not derive pleasure although it may provide a release from tension.
subclass of: Anxiety Disorders

Space Perception
type: Class
subclass of: Visual Perception
definition: The awareness of the spatial properties of objects; including physical space.

Expressive Lexicon
type: Class
definition: The vocabulary that an individual can produce.
subclass of: Expressive Language

Sleeping Problems
type: Class
definition: Disturbances of usual sleep patterns or behaviors.
subclass of: Neurologic Indications

Distant or Preoccupied Affect
type: Class
definition: Appearing unemotional, unresponsive, or disconnected from one's physical environment.
subclass of: Affect

Engagement in Social Activities
type: Class
subclass of: Community Life Skills
definition: Participating in informal or casual gatherings or groups with others who have common interests.

Expressive Syntax
type: Class
definition: The ability to produce phrases and sentences according to the rules of grammar.
subclass of: Expressive Language

Managing Internal Emotions
type: Class
subclass of: Control of Emotional Reactions
definition: The ability to control and appropriately manage emotional responses when under stress.

Maintenance and Organization of Possessions
type: Class
definition: Arranging one's own possessions, including returning possessions to proper arrangement after use and finding possessions when needed.
subclass of: Home Life Skills

Task Initiation
type: Class
definition: Preparing and arranging the time and space for performance of a task with one or more components and undertaking execution of the task.
subclass of: Task Performance

Working Memory
type: Class
definition: The temporary storage and manipulation of the information necessary for such complex cognitive tasks as language comprehension, learning, and reasoning. Working memory has been found to require the simultaneous storage and processing of information.
subclass of: Executive Function

Sharing in Interests of Others
type: Class
subclass of: Interactions with Friends and Family
definition: Showing interest in participating in or learning about activities or topics that others express enjoyment in.

Participation in Athletic Activities
type: Class
subclass of: Engagement in Social Activities
definition: Engaging in competitive and informal or formally organized games or athletic events, performed alone or in a group.

Ability to Engage in Casual Conversation
type: Class
definition: The ability to maintain casual interactions with others such as chatting and small talk, in a contextually and socially appropriate manner.
subclass of: Ability to Converse in Social Settings

Understanding the Effect of One's Actions
type: Class
definition: The ability to recognize how one's own behavior affects others, including recognizing when one's behavior bothers others, or when one's behavior hurts another individual.
subclass of: Interpersonal Awareness

Poor Eating Behavior
type: Class
subclass of: Self-Care
definition: Behavior related to feeding which negatively affects the quality or amount of food eaten and digested.

Response Inhibition
type: Class
definition: The interference with or prevention of a behavioral or verbal response even though the stimulus for that response is present.
subclass of: Executive Function

Expressive Semantics
type: Class
definition: The ability to produce phrases, sentences, or sets of sentences that successfully convey meaning.
subclass of: Expressive Language

Drug Abuse
type: Class
subclass of: Substance Abuse
definition: Overuse or misuse of medications or other drugs.

Overactivity
type: Class
definition: Being active to an abnormal degree.
subclass of: Abnormal Activity or Energy Level

Non-Verbal Communication
type: Class
subclass of: Language Ability
definition: Transmission of emotions, ideas, and attitudes between individuals in ways other than the spoken language.

Disobedience
type: Class
subclass of: Intentional Bad Behavior
definition: Intentionally violating rules, commands or prohibitions.

Ear Diseases
type: Class
subclass of: Comorbidities
definition: Pathological processes of the ear, the hearing, and the equilibrium system of the body.

Transitioning Ability
type: Class
subclass of: Mental Flexibility
definition: The ability to shift attention from one activity or focus to another when required to do so.

Preparing for Tasks
type: Class
definition: The ability to successfully manage arranging materials, space, or time as needed to facilitate performance of tasks.
subclass of: Planning

Obstetric Delivery Complications
type: Class
definition: The occurrence of a pregnancy complication during childbirth, which includes both labor (the process of childbirth) and delivery (the birth itself).
subclass of: Perinatal History

Receptive Syntax
type: Class
definition: The ability to comprehend phrases and sentences according to the rules of grammar.
subclass of: Receptive Language

Angelman Syndrome
type: Class
definition: A syndrome characterized by multiple abnormalities, mental retardation, and movement disorders. Present usually are skull and other abnormalities, frequent infantile spasms easily provoked and prolonged paroxysms of laughter, jerky puppet-like movements, continuous tongue protrusion; motor retardation; ataxia, muscle hypotonia, and a peculiar facies.
subclass of: Central Nervous System Diseases

Eye Contact
type: Class
definition: Meeting the eyes of another individual in an effort to communicate or in response to communication by the other individual, and integrating eye contact with verbal interaction, including looking at the individual speaking or being addressed.
subclass of: Reciprocal Social Interaction

Relating to Others
type: Class
definition: Beginning and maintaining interactions with others for a short or long period of time, in a contextually and socially appropriate manner.
subclass of: Reciprocal Social Interaction

Pica
type: Class
definition: The persistent eating of nonnutritive substances.
subclass of: Neurologic Indications

Impatience
type: Class
definition: The inability to wait calmly without feelings of agitation.
subclass of: Impulse Control and Regulation

Receptive Lexicon
type: Class
subclass of: Receptive Language
definition: The vocabulary that an individual is able to understand.

Hearing Loss
type: Class
definition: A general term for the complete or partial loss of the ability to hear from one or both ears.
subclass of: Ear Diseases

Urogenital Diseases
type: Class
subclass of: Comorbidities
definition: Pathological processes of the female or male urinary tract and the reproductive system (genitalia). In females this includes disorders related to pregnancy.

Hygiene
type: Class
definition: Maintaining personal cleanliness.
subclass of: Self-Care

Pregnancy Outcome
type: Class
subclass of: Perinatal History
definition: Results of conception and ensuing pregnancy. The outcome may follow natural or artificial insemination or any assisted reproductive technique.

Learning Disorders
type: Class
subclass of: Mental Disorders
definition: Conditions characterized by a significant discrepancy between an individual's perceived level of intellect and their ability to acquire new language and other cognitive skills.

Otitis
type: Class
subclass of: Ear Diseases
definition: Inflammation of the ear, which may be marked by pain, fever, hearing disorders, and vertigo. Inflammation of the external ear is otitis externa; of the middle ear, otitis media; of the inner ear, labyrinthitis.

Celiac Disease
type: Class
definition: A malabsorption syndrome that is precipitated by the ingestion of gluten-containing foods, such as wheat, rye, and barley. It is characterized by inflammation of the small intestine, loss of microvilli structure, failed intestinal absorption, and malnutrition.
subclass of: Gastrointestinal Diseases

IQ
type: Class
subclass of: Cognitive Ability
definition: The ability to learn and to deal with new situations and to deal effectively with tasks involving abstractions. The relative intelligence of an individual is expressed as a score on a standardized test of intelligence.

Head Injury
type: Class
subclass of: Exposures
definition: Traumatic injury involving the cranium and intracranial structures, including the brain, cranial nerves, or meninges.

Lethargy
type: Class
definition: A general state of sluggishness, listlessness, or tiredness, and having difficulty concentrating and doing simple tasks.
subclass of: Abnormal Activity or Energy Level

Destructive Behavior
type: Class
subclass of: Intentional Bad Behavior
definition: Intentionally damaging one's own or others' belongings.

Attention and Focus
type: Class
definition: The ability to focus on an external stimulus or internal experience for the required period of time, including intentionally focusing on specific stimuli, such as by filtering out distracting noises.
subclass of: Working Memory

Facial Expressions
type: Class
subclass of: Non-Verbal Communication
definition: Observable changes of expression in the face in response to emotional stimuli.

Hydrocephalus
type: Class
definition: Excessive accumulation of cerebrospinal fluid within the cranium that may be associated with dilation of cerebral ventricles, intracranial hypertension, headache, lethargy, urinary incontinence, and ataxia (and in infants macrocephaly).
subclass of: Central Nervous System Diseases

Adherence to Rules in the Community
type: Class
subclass of: Community Life Skills
definition: Understanding and obeying rules and laws when in the broader community.

Social Dependence on Others
type: Class
subclass of: Social Interest
definition: Requiring a high degree of attention from others, including being unable to act appropriately when left alone by caregiver.

Gestures
type: Class
definition: Movement of a part of the body for the purpose of communication.
subclass of: Non-Verbal Communication

Quality of Performed Task
type: Class
definition: The degree of excellence with which a task is performed.
subclass of: Task Performance

Seizures
type: Class
subclass of: Epilepsy
definition: Clinical or subclinical disturbances of cortical function due to a sudden, abnormal, excessive, and disorganized discharge of brain cells. Clinical manifestations include abnormal motor, sensory and psychic phenomena.

Joint Attention
type: Class
definition: Sharing attentional focus with others between objects or events.
subclass of: Reciprocal Social Interaction

Emotional Swings
type: Class
subclass of: Mood
definition: Tendency to display unpredictable, extreme, and rapidly changing emotions or moods.

Empathy
type: Class
subclass of: Interpersonal Awareness
definition: An individual's objective and insightful awareness of the feelings and behavior of others, including demonstration of an awareness of and a concern for the good of others.

Problem Solving Ability
type: Class
definition: Finding solutions to questions or situations by identifying and analyzing issues, developing options and solutions, evaluating potential effects of solutions, and executing a chosen solution.
subclass of: Reasoning

Hospitalizations
type: Class
subclass of: Exposures
definition: The confinement of a patient in a hospital.

Autistic Disorder
type: Class
definition: A disorder beginning in childhood. It is marked by the presence of markedly abnormal or impaired development in social interaction and communication and a markedly restricted repertoire of activity and interest.
subclass of: Primary Diagnosis

Motor Perseveration
type: Class
definition: Persistent repetition of a response to stimuli.
subclass of: Involuntary Behaviors

Cardiovascular Diseases
type: Class
subclass of: Comorbidities
definition: Pathological conditions involving the cardiovascular system including the heart, the blood vessels, or the pericardium.

Imitation
type: Class
subclass of: Reciprocal Social Interaction
definition: Mimicking or copying the movements of other individuals as a means of interaction and play as well as to learn by modeling the actions and behaviors of others.

Ability to Convey Appropriate Level of Detail
type: Class
subclass of: Ability to Convey Information
definition: The ability to recognize and express the appropriate amount of information required during conversation on a given topic, such as sharing details that will interest another without including unnecessary information.

Awareness of Harmful Social Situations
type: Class
definition: Recognizing when being treated poorly or unfairly by others.
subclass of: Awareness of Social Cues

Crohn Disease
type: Class
subclass of: Inflammatory Bowel Diseases
definition: A chronic transmural inflammation that may involve any part of the digestive tract from mouth to anus, mostly found in the ileum, the cecum, and the colon.

Tuberous Sclerosis
type: Class
definition: An autosomal dominant disorder which is generally classified as a phacomatosis. The condition is characterized by glial cell tumors which arise in the cerebral hemispheres and retina. There is an increased incidence of benign rhabdomyomas of the heart and angiomyolipomas of kidney, liver, lungs, thyroid, and testes.
subclass of: Neurodegenerative Diseases

Congenital Rubella Syndrome
type: Class
subclass of: Congenital Abnormalities
definition: Transplacental infection of the fetus with rubella usually in the first trimester of pregnancy, as a consequence of maternal infection, resulting in various developmental abnormalities in the newborn infant.

Aggressive Behavior
type: Class
definition: Behavior which may be manifested by destructive and attacking action which is verbal or physical, by covert attitudes of hostility or by obstructionism.
subclass of: Intentional Bad Behavior

Compulsive Behavior
type: Class
subclass of: Restricted and Repetitive Behavior
definition: Performing an act persistently and repetitively without it leading to reward or pleasure.

Cerebral Palsy
type: Class
subclass of: Central Nervous System Diseases
definition: A heterogeneous group of nonprogressive motor disorders caused by chronic brain injuries that originate in the prenatal period, perinatal period, or first few years of life. The four major subtypes are spastic, athetoid, ataxic, and mixed cerebral palsy, with spastic forms being the most common. The motor disorder may range from difficulties with fine motor control to severe spasticity in all limbs.

Isolated Cognitive Skills
type: Class
subclass of: Cognitive Ability
definition: Showing extreme proficiency in certain areas with special abilities, for example, in memory, music, drawing, reading and computational skills.

Digestive Complaints
type: Class
definition: Symptoms related to the gastrointestinal system.
subclass of: Complaints and Indications

Responsiveness to Social Advances
type: Class
definition: Reacting positively by attempts of others to initial social interaction.
subclass of: Initiating and Responding to Social Overtures

Skill in Understanding Humor
type: Class
subclass of: Understanding Context
definition: The ability to recognize and enjoy humorous statements, including jokes, irony, and sarcasm.

Regression of General Skills
type: Class
definition: Loss or decline of abilities or skills that have already been learned.
subclass of: Adaptive Life Skills

Clothing Self
type: Class
subclass of: Self-Care
definition: Carrying out the coordinated actions and tasks of putting on and taking off clothes and footwear in sequence and in keeping with climatic and social conditions.

Expressive Morphology
type: Class
definition: The ability to produce accurate forms of words, including the inflections that indicate the grammatical role of a word.
subclass of: Expressive Language

Receptive Semantics
type: Class
subclass of: Receptive Language
definition: The ability to understand language meaning.

Landau-Kleffner Syndrome
type: Class
definition: A syndrome characterized by the onset of isolated language dysfunction in otherwise normal children (age of onset 4-7 years) and epileptiform discharges on electroencephalography. Seizures, including atypical absence, complex partial, and other types may occur.
subclass of: Epilepsy

Sorting Ability
type: Class
subclass of: Mental Flexibility
definition: The ability to sort objects in different ways as instructed, including sorting the same objects multiple times by different rules.

Apgar Score
type: Class
definition: A method to evaluate a newborn's adjustment to extrauterine life. Five items - heart rate, respiratory effort, muscle tone, reflex irritability, and color - are evaluated.
subclass of: Perinatal History

Medications
type: Class
definition: Drugs intended for treatment of physical or mental disorders.
subclass of: Exposures

Neurofibromatoses
type: Class
definition: A group of disorders characterized by an autosomal dominant pattern of inheritance with high rates of spontaneous mutation and multiple neurofibromas or neurilemmomas.
subclass of: Neurodegenerative Diseases

Insistence on Routine
type: Class
definition: Insistence on a specific sequence of ordered events and actions and intolerance of deviation from such routines.
subclass of: Adherence to Rituals and Routines

Systemic Lupus Erythematosus
type: Class
definition: A chronic, relapsing, inflammatory, and often febrile multisystemic disorder of connective tissue, characterized principally by involvement of the skin, joints, kidneys, and serosal membranes.
subclass of: Autoimmune Diseases

Diabetes Mellitus Type 1
type: Class
subclass of: Endocrine System Diseases
definition: A subtype of diabetes mellitus that is characterized by insulin deficiency.

Regard for Customs and Manners
type: Class
subclass of: Recognition of Social Norms
definition: Recognizing and adhering to social conventions governing oneself and one's behavior in public and around others.

Irritable Bowel Syndrome
type: Class
subclass of: Gastrointestinal Diseases
definition: A disorder with chronic or recurrent colonic symptoms without a clear-cut etiology. This condition is characterized by chronic or recurrent abdominal pain, bloating, mucus in feces, and an erratic disturbance of defecation.

Sensitivity to Conversant
type: Class
definition: Observant of other participant in conversation, such as recognizing if other participant appears bored, not changing the topic of conversation if others are not interested, and not interrupting others in conversation.
subclass of: Conversational Skills

Decision Making Ability
type: Class
definition: Making a choice among options, implementing the choice, and evaluating the effects of the choice, or deciding to undertake and undertaking one task from among several tasks that need to be done.
subclass of: Planning

Participation in Play Activities
type: Class
definition: Engaging in games and other recreation.
subclass of: Engagement in Social Activities

Anger Control
type: Class
subclass of: Control of Emotional Reactions
definition: The ability to control and appropriately manage a strong emotional feeling of displeasure aroused by being interfered with, injured or threatened.

Poor Treatment by Others in Social Settings
type: Class
subclass of: Interactions with Friends and Family
definition: Being treated poorly by others in public, such as being frequently laughed at, made fun of, or bullied.

Class 21
question id: 4500069